ATF Tests Results

Execution summary

Item

Value

ATF

Version

Automated Testing Framework 0.20 (atf-0.20)

Timings

Start time of tests

Thu Jun 16 01:32:39 UTC 2016

End time of tests

Thu Jun 16 07:29:35 UTC 2016

System information

Host name

Operating system

NetBSD

Operating system release

7.99.30

Operating system version

NetBSD 7.99.30 (GENERIC) #0: Thu Jun 16 01:14:38 UTC 2016 root@babylon5.netbsd.org:/tmp/bracket/build/2016.06.15.04.33.52-i386/obj/sys/arch/i386/compile/GENERIC

Platform

i386

Tests results

Root

/usr/tests

Test programs

653

Bogus test programs

10

Test cases

4541

Passed test cases

4282

Failed test cases

122

Expected failures

53

Skipped test cases

84

See more execution details

Test cases summary

Test case

Result

Reason

Duration

bin/cat/t_cat

4.061419s

align

Passed

N/A

1.992980s

nonexistent

Passed

N/A

1.956264s

bin/cp/t_cp

0.029260s

bin/dd/t_dd

13.009813s

io

Passed

N/A

5.565888s

length

Passed

N/A

2.486684s

seek

Passed

N/A

4.752172s

bin/df/t_df

0.010957s

bin/expr/t_expr

13.741107s

arithmetic_ops

Passed

N/A

1.424022s

basic_functional

Passed

N/A

0.674871s

basic_math

Passed

N/A

0.755091s

colon_vs_math

Passed

N/A

0.565764s

compare_ops

Passed

N/A

2.368463s

compare_ops_precedence

Passed

N/A

0.522877s

gtkmm

Passed

N/A

1.256058s

lang

Passed

N/A

1.389209s

math_precedence

Passed

N/A

0.536433s

multiply

Failed

Test program received signal 11 (core dumped)

0.082862s

negative

Passed

N/A

0.958578s

overflow

Passed

N/A

1.472797s

precedence

Passed

N/A

0.571101s

regex

Passed

N/A

0.893212s

bin/pax/t_pax

3.713704s

append

Passed

N/A

3.664721s

bin/ps/t_ps

0.016900s

bin/sh/dotcmd/t_dotcmd

294.963921s

case_break_case

Passed

N/A

2.380751s

case_break_compound

Passed

N/A

1.527967s

case_break_file

Passed

N/A

1.434714s

case_break_for

Passed

N/A

2.085409s

case_break_func

Passed

N/A

2.004412s

case_break_subshell

Passed

N/A

2.269854s

case_break_until

Passed

N/A

2.009098s

case_break_while

Passed

N/A

2.020066s

case_continue_case

Passed

N/A

2.159158s

case_continue_compound

Passed

N/A

2.037794s

case_continue_file

Passed

N/A

2.392637s

case_continue_for

Passed

N/A

2.958427s

case_continue_func

Passed

N/A

2.076707s

case_continue_subshell

Passed

N/A

1.700524s

case_continue_until

Passed

N/A

1.899111s

case_continue_while

Passed

N/A

1.923648s

case_return_case

Passed

N/A

1.857569s

case_return_compound

Passed

N/A

2.174635s

case_return_file

Passed

N/A

1.984849s

case_return_for

Passed

N/A

0.883807s

case_return_func

Passed

N/A

1.938838s

case_return_subshell

Passed

N/A

2.068549s

case_return_until

Passed

N/A

1.679165s

case_return_while

Passed

N/A

1.889372s

compound_break_case

Passed

N/A

1.647195s

compound_break_compound

Passed

N/A

1.659916s

compound_break_file

Passed

N/A

1.819878s

compound_break_for

Passed

N/A

1.691182s

compound_break_func

Passed

N/A

1.871183s

compound_break_subshell

Passed

N/A

1.571610s

compound_break_until

Passed

N/A

1.274115s

compound_break_while

Passed

N/A

2.158106s

compound_continue_case

Passed

N/A

1.959207s

compound_continue_compound

Passed

N/A

2.315607s

compound_continue_file

Passed

N/A

2.272333s

compound_continue_for

Passed

N/A

1.822946s

compound_continue_func

Passed

N/A

1.502323s

compound_continue_subshell

Passed

N/A

2.321736s

compound_continue_until

Passed

N/A

1.950479s

compound_continue_while

Passed

N/A

1.653688s

compound_return_case

Passed

N/A

2.310521s

compound_return_compound

Passed

N/A

1.766772s

compound_return_file

Passed

N/A

2.191162s

compound_return_for

Passed

N/A

1.693075s

compound_return_func

Passed

N/A

1.422114s

compound_return_subshell

Passed

N/A

2.363862s

compound_return_until

Passed

N/A

1.915484s

compound_return_while

Passed

N/A

1.635082s

file_break_case

Passed

N/A

2.016723s

file_break_compound

Passed

N/A

2.247202s

file_break_file

Passed

N/A

1.841792s

file_break_for

Passed

N/A

1.928326s

file_break_func

Passed

N/A

1.655392s

file_break_subshell

Passed

N/A

1.677123s

file_break_until

Passed

N/A

1.614875s

file_break_while

Passed

N/A

1.502864s

file_continue_case

Passed

N/A

1.571279s

file_continue_compound

Passed

N/A

2.232804s

file_continue_file

Passed

N/A

1.971531s

file_continue_for

Passed

N/A

2.295694s

file_continue_func

Passed

N/A

2.258449s

file_continue_subshell

Passed

N/A

1.944508s

file_continue_until

Passed

N/A

2.026700s

file_continue_while

Passed

N/A

2.420982s

file_return_case

Passed

N/A

1.989640s

file_return_compound

Passed

N/A

1.037106s

file_return_file

Passed

N/A

2.404772s

file_return_for

Passed

N/A

1.503079s

file_return_func

Passed

N/A

1.428208s

file_return_subshell

Passed

N/A

2.145875s

file_return_until

Passed

N/A

1.797386s

file_return_while

Passed

N/A

1.995845s

for_break_case

Passed

N/A

2.213434s

for_break_compound

Passed

N/A

1.955723s

for_break_file

Passed

N/A

1.204867s

for_break_for

Passed

N/A

1.660273s

for_break_func

Passed

N/A

0.924406s

for_break_subshell

Passed

N/A

1.359253s

for_break_until

Passed

N/A

1.174058s

for_break_while

Passed

N/A

1.733108s

for_continue_case

Passed

N/A

1.580798s

for_continue_compound

Passed

N/A

0.932508s

for_continue_file

Passed

N/A

2.256034s

for_continue_for

Passed

N/A

0.947553s

for_continue_func

Passed

N/A

1.896708s

for_continue_subshell

Passed

N/A

1.514307s

for_continue_until

Passed

N/A

1.284685s

for_continue_while

Passed

N/A

1.480145s

for_return_case

Passed

N/A

1.473897s

for_return_compound

Passed

N/A

1.017345s

for_return_file

Passed

N/A

1.727379s

for_return_for

Passed

N/A

1.688052s

for_return_func

Failed

Test case exited normally but failed to create the results file: Failed to open /tmp/atf-run.7gBRGI/tcr

1.361886s

for_return_subshell

Passed

N/A

1.141862s

for_return_until

Passed

N/A

1.319864s

for_return_while

Passed

N/A

1.949726s

func_break_case

Passed

N/A

1.706608s

func_break_compound

Passed

N/A

2.174106s

func_break_file

Passed

N/A

1.007718s

func_break_for

Passed

N/A

1.347537s

func_break_func

Passed

N/A

1.252492s

func_break_subshell

Passed

N/A

1.642399s

func_break_until

Passed

N/A

0.891447s

func_break_while

Passed

N/A

1.933073s

func_continue_case

Passed

N/A

1.586917s

func_continue_compound

Passed

N/A

1.415988s

func_continue_file

Passed

N/A

2.334359s

func_continue_for

Passed

N/A

1.159610s

func_continue_func

Passed

N/A

1.657262s

func_continue_subshell

Passed

N/A

1.197375s

func_continue_until

Passed

N/A

2.116029s

func_continue_while

Passed

N/A

1.861236s

func_return_case

Passed

N/A

0.898947s

func_return_compound

Passed

N/A

1.516378s

func_return_file

Passed

N/A

1.100611s

func_return_for

Passed

N/A

1.191363s

func_return_func

Passed

N/A

1.482533s

func_return_subshell

Passed

N/A

1.503800s

func_return_until

Passed

N/A

2.019824s

func_return_while

Passed

N/A

0.940126s

subshell_break_case

Passed

N/A

1.435527s

subshell_break_compound

Passed

N/A

1.128576s

subshell_break_file

Passed

N/A

1.034124s

subshell_break_for

Passed

N/A

0.983979s

subshell_break_func

Passed

N/A

1.372349s

subshell_break_subshell

Passed

N/A

0.956375s

subshell_break_until

Passed

N/A

1.227774s

subshell_break_while

Passed

N/A

1.000995s

subshell_continue_case

Passed

N/A

1.598099s

subshell_continue_compound

Passed

N/A

1.136668s

subshell_continue_file

Failed

Test program received signal 11 (core dumped)

0.083744s

subshell_continue_for

Passed

N/A

1.206972s

subshell_continue_func

Passed

N/A

1.027418s

subshell_continue_subshell

Passed

N/A

1.226099s

subshell_continue_until

Passed

N/A

1.012551s

subshell_continue_while

Passed

N/A

1.396041s

subshell_return_case

Passed

N/A

0.921613s

subshell_return_compound

Passed

N/A

0.902789s

subshell_return_file

Passed

N/A

1.550666s

subshell_return_for

Passed

N/A

1.081791s

subshell_return_func

Passed

N/A

1.066304s

subshell_return_subshell

Passed

N/A

0.919725s

subshell_return_until

Passed

N/A

1.346968s

subshell_return_while

Passed

N/A

1.152017s

until_break_case

Passed

N/A

1.026674s

until_break_compound

Passed

N/A

1.302282s

until_break_file

Passed

N/A

0.955706s

until_break_for

Passed

N/A

1.027660s

until_break_func

Passed

N/A

0.909899s

until_break_subshell

Passed

N/A

0.912129s

until_break_until

Passed

N/A

0.915681s

until_break_while

Passed

N/A

0.910879s

until_continue_case

Passed

N/A

0.901041s

until_continue_compound

Passed

N/A

0.899433s

until_continue_file

Passed

N/A

0.884403s

until_continue_for

Passed

N/A

0.892490s

until_continue_func

Passed

N/A

0.890202s

until_continue_subshell

Passed

N/A

0.913117s

until_continue_until

Passed

N/A

0.866305s

until_continue_while

Passed

N/A

0.912163s

until_return_case

Passed

N/A

0.925488s

until_return_compound

Passed

N/A

0.895794s

until_return_file

Passed

N/A

0.879032s

until_return_for

Passed

N/A

0.894100s

until_return_func

Passed

N/A

0.913163s

until_return_subshell

Passed

N/A

0.928634s

until_return_until

Passed

N/A

0.877549s

until_return_while

Passed

N/A

1.199954s

while_break_case

Passed

N/A

0.914335s

while_break_compound

Passed

N/A

0.902593s

while_break_file

Passed

N/A

1.137133s

while_break_for

Passed

N/A

1.376519s

while_break_func

Passed

N/A

0.993471s

while_break_subshell

Passed

N/A

1.480947s

while_break_until

Passed

N/A

1.433482s

while_break_while

Passed

N/A

1.406218s

while_continue_case

Passed

N/A

1.457337s

while_continue_compound

Failed

atf-check failed; see the output of the test for details

1.262085s

while_continue_file

Passed

N/A

1.372590s

while_continue_for

Passed

N/A

1.388247s

while_continue_func

Passed

N/A

1.077314s

while_continue_subshell

Passed

N/A

1.523124s

while_continue_until

Passed

N/A

1.419582s

while_continue_while

Passed

N/A

1.440200s

while_return_case

Passed

N/A

1.240263s

while_return_compound

Passed

N/A

1.358961s

while_return_file

Passed

N/A

1.435166s

while_return_for

Passed

N/A

1.056985s

while_return_func

Passed

N/A

1.256461s

while_return_subshell

Passed

N/A

1.349165s

while_return_until

Passed

N/A

1.259396s

while_return_while

Passed

N/A

1.412778s

bin/sh/t_arith

119.998790s

constants

Passed

N/A

5.730094s

do_unary_minus

Passed

N/A

2.960309s

do_unary_not

Passed

N/A

2.528718s

do_unary_plus

Passed

N/A

2.790277s

do_unary_tilde

Passed

N/A

2.889827s

elementary_add

Passed

N/A

5.153830s

elementary_div

Passed

N/A

5.048880s

elementary_eq

Passed

N/A

5.908045s

elementary_ge

Passed

N/A

2.787952s

elementary_gt

Passed

N/A

5.328258s

elementary_le

Passed

N/A

4.319101s

elementary_lt

Passed

N/A

4.025503s

elementary_mul

Passed

N/A

4.216957s

elementary_ne

Passed

N/A

3.943953s

elementary_rem

Passed

N/A

5.409986s

elementary_shl

Passed

N/A

4.057182s

elementary_shr

Passed

N/A

4.846477s

elementary_sub

Passed

N/A

4.800768s

fiddle_bits_and

Passed

N/A

3.976071s

fiddle_bits_or

Passed

N/A

3.909236s

fiddle_bits_xor

Passed

N/A

3.936931s

logical_and

Passed

N/A

3.879838s

logical_or

Passed

N/A

3.925993s

make_selection

Passed

N/A

3.813224s

operator_precedence

Passed

N/A

9.884671s

parentheses

Passed

N/A

9.174124s

bin/sh/t_cmdsub

60.853682s

a_basic_cmdsub

Failed

Test case exited normally but failed to create the results file: Failed to open /tmp/atf-run.XJW778/tcr

0.732378s

b_basic_backticks

Passed

N/A

6.139954s

c_nested_cmdsub

Passed

N/A

2.018637s

d_nested_backticks

Passed

N/A

2.045596s

e_perverse_mixing

Passed

N/A

2.325316s

f_redirect_in_cmdsub

Passed

N/A

2.862735s

g_redirect_in_backticks

Failed

Test case exited normally but failed to create the results file: Failed to open /tmp/atf-run.XJW778/tcr

0.574037s

h_vars_in_cmdsub

Passed

N/A

4.061349s

i_vars_in_backticks

Passed

N/A

4.126301s

j_cmdsub_in_varexpand

Passed

N/A

1.744240s

k_backticks_in_varexpand

Passed

N/A

2.422417s

l_arithmetic_in_cmdsub

Passed

N/A

2.088217s

m_arithmetic_in_backticks

Passed

N/A

1.405902s

n_cmdsub_in_arithmetic

Passed

N/A

1.087177s

o_backticks_in_arithmetic

Passed

N/A

1.491544s

p_cmdsub_in_heredoc

Passed

N/A

1.376682s

q_backticks_in_heredoc

Passed

N/A

1.190982s

r_heredoc_in_cmdsub

Passed

N/A

2.336279s

s_heredoc_in_backticks

Passed

N/A

1.726767s

t_nested_cmdsubs_in_heredoc

Passed

N/A

2.514630s

u_nested_backticks_in_heredoc

Passed

N/A

2.581567s

v_cmdsub_paren_tests

Passed

N/A

6.964141s

w_heredoc_outside_cmdsub

Passed

N/A

2.210733s

x_heredoc_outside_backticks

Passed

N/A

1.754962s

z_absurd_heredoc_cmdsub_combos

Passed

N/A

2.195857s

bin/sh/t_evaltested

1.049163s

evaltested

Passed

N/A

0.948005s

bin/sh/t_exit

18.291969s

background

Passed

N/A

1.572152s

function

Passed

N/A

1.218691s

readout

Passed

N/A

1.213547s

simple_exit

Passed

N/A

6.161919s

subshell_background

Passed

N/A

1.002113s

subshell_exit

Failed

atf-check failed; see the output of the test for details

3.419095s

trap_subshell

Passed

N/A

1.254563s

trap_zero__explicit_exit

Passed

N/A

1.132742s

trap_zero__implicit_exit

Passed

N/A

1.021778s

bin/sh/t_expand

18.371614s

arithmetic

Failed

Test program received signal 11 (core dumped)

0.198413s

dollar_at

Passed

N/A

1.490445s

dollar_at_with_text

Passed

N/A

3.570271s

iteration_on_null_or_missing_parameter

Passed

N/A

0.830188s

iteration_on_null_or_null_parameter

Passed

N/A

1.142598s

iteration_on_null_parameter

Passed

N/A

1.082768s

iteration_on_quoted_null_parameter

Passed

N/A

1.113673s

shell_params

Passed

N/A

3.051944s

strip

Passed

N/A

4.732009s

varpattern_backslashes

Passed

N/A

0.834765s

bin/sh/t_fsplit

22.123862s

default_val

Passed

N/A

5.655121s

dollar_at

Passed

N/A

3.158405s

for

Passed

N/A

0.544475s

ifs

Passed

N/A

1.920905s

ifs_alpha

Passed

N/A

1.601956s

quote

Passed

N/A

0.903787s

replacement_val

Passed

N/A

6.485052s

var_length

Passed

N/A

1.550678s

bin/sh/t_here

80.684865s

do_simple

Passed

N/A

6.560946s

end_markers

Failed

Test end_markers: 1 subtests (of 236) failed - see stderr

61.212019s

incomplete

Failed

Test program received signal 11 (core dumped)

0.149524s

lineends

Passed

N/A

3.817245s

multiple

Passed

N/A

2.143714s

nested

Passed

N/A

1.572289s

quoting

Passed

N/A

1.935494s

side_effects

Passed

N/A

1.209279s

vicious

Passed

N/A

1.784848s

bin/sh/t_option

43.202371s

Option_switching

Failed

atf-check failed; see the output of the test for details

8.193843s

restore_local_opts

Failed

Test case exited normally but failed to create the results file: Failed to open /tmp/atf-run.iqtO1M/tcr

0.727903s

set_C

Passed

N/A

4.002060s

set_a

Passed

N/A

2.198694s

set_e

Passed

N/A

2.341792s

set_f

Passed

N/A

2.175071s

set_n

Passed

N/A

8.211286s

set_u

Passed

N/A

5.592240s

set_v

Passed

N/A

2.859182s

set_x

Passed

N/A

2.578530s

vi_emacs_VE_toggle

Passed

N/A

2.631851s

xx_bogus

Passed

N/A

1.168651s

bin/sh/t_redir

39.629555s

basic_test_method_test

Passed

N/A

3.472157s

do_input_redirections

Passed

N/A

6.915920s

do_output_redirections

Passed

N/A

4.297752s

fd_redirections

Passed

N/A

8.376041s

incorrect_redirections

Passed

N/A

5.631162s

local_redirections

Failed

Test case exited normally but failed to create the results file: Failed to open /tmp/atf-run.V88nE1/tcr

0.796236s

named_fd_redirections

Passed

N/A

3.560202s

redir_here_doc

Passed

N/A

1.296710s

redir_in_case

Passed

N/A

1.226521s

subshell_redirections

Passed

N/A

1.543248s

ulimit_redirection_interaction

Passed

N/A

1.263045s

validate_fn_redirects

Failed

atf-check failed; see the output of the test for details

0.844373s

bin/sh/t_redircloexec

9.833013s

compound_redir_open

Passed

N/A

1.318683s

exec_redir_closed

Passed

N/A

3.055377s

exec_redir_open

Passed

N/A

2.911371s

loop_redir_open

Passed

N/A

0.786460s

simple_redir_open

Passed

N/A

0.767692s

subshell_redir_open

Passed

N/A

0.834347s

bin/sh/t_set_e

18.743715s

all

Passed

N/A

18.695467s

bin/sh/t_shift

15.918234s

basic_shift_test

Passed

N/A

3.755769s

excessive_shift

Passed

N/A

4.231018s

function_shift

Passed

N/A

0.865108s

non_numeric_shift

Passed

N/A

4.159090s

too_many_args

Passed

N/A

2.711885s

bin/sh/t_ulimit

1.884424s

limits

Passed

N/A

1.835503s

bin/sh/t_varquote

3.019370s

all

Passed

N/A

0.849429s

default_assignment_with_arith

Passed

N/A

1.280813s

nested_quotes_multiword

Passed

N/A

0.810430s

bin/sh/t_varval

27.307123s

aaa

Passed

N/A

2.541601s

assignment

Passed

N/A

5.174897s

cmdline

Passed

N/A

5.430907s

read

Passed

N/A

6.286274s

redirect

Passed

N/A

6.747736s

bin/sh/t_wait

35.503485s

basic_wait

Failed

atf-check failed; see the output of the test for details

1.359736s

individual

Passed

N/A

7.080719s

jobs

Passed

N/A

15.844522s

kill

Passed

N/A

11.003951s

bin/sleep/t_sleep

8.177726s

fraction

Passed

N/A

2.658177s

hex

Passed

N/A

3.280929s

nonnumeric

Passed

N/A

2.083545s

bin/tar/t_tar

2.313733s

append

Passed

N/A

2.256255s

dev/cgd/t_cgd

24.596381s

basic

Passed

N/A

7.215502s

unaligned_write

Passed

N/A

8.816021s

wrongpass

Passed

N/A

8.412540s

dev/raidframe/t_raid

97.398231s

raid1_comp0fail

Passed

N/A

17.638647s

raid1_compfail

Passed

N/A

14.247441s

raid1_normal

Passed

N/A

17.968983s

raid5_compfail

Failed

atf-check failed; see the output of the test for details

20.633270s

raid5_normal

Passed

N/A

22.736538s

smalldisk

Passed

N/A

3.688475s

dev/audio/t_pad

3.598743s

pad_output

Passed

N/A

3.536105s

dev/md/t_md

5.200367s

basic

Passed

N/A

5.122130s

dev/scsipi/t_cd

0.700544s

noisyeject

Passed

N/A

0.656002s

dev/sysmon/t_swwdog

6.889999s

disarm

Failed

/tmp/bracket/build/2016.06.15.04.33.52-i386/src/tests/dev/sysmon/t_swwdog.c:84: tcount != max

1.695955s

panic

Passed

N/A

2.590610s

reboot

Passed

N/A

2.469570s

dev/sysmon/t_swsensor

312.083303s

alarm_sensor

Passed

N/A

68.029630s

entropy_interrupt_sensor

Passed

N/A

45.654799s

entropy_polled_sensor

Passed

N/A

78.573468s

limit_sensor

Passed

N/A

71.420925s

simple_sensor

Passed

N/A

48.081784s

dev/usb/t_hid

3.788972s

khid

Failed

Test program received signal 11 (core dumped)

3.219176s

khid_parse_just_pop

Passed

N/A

0.493150s

games/t_factor

0.062070s

loop

Skipped

Required program '/usr/games/factor' not found in the PATH

0.018899s

overflow

Skipped

Required program '/usr/games/factor' not found in the PATH

0.002901s

include/machine/t_bswap

0.651005s

bswap16_basic

Passed

N/A

0.154306s

bswap16_unconst

Passed

N/A

0.081607s

bswap32_basic

Passed

N/A

0.079943s

bswap32_unconst

Passed

N/A

0.079692s

bswap64_basic

Passed

N/A

0.080042s

bswap64_unconst

Passed

N/A

0.080846s

include/sys/t_bitops

1.017397s

bitmap_basic

Passed

N/A

0.165919s

fast_divide32

Passed

N/A

0.099208s

ffsfls

Passed

N/A

0.232521s

ilog2_32bit

Passed

N/A

0.163013s

ilog2_64bit

Passed

N/A

0.101415s

ilog2_const

Passed

N/A

0.098299s

include/sys/t_bootblock

0.299675s

mbr_partition

Passed

N/A

0.157320s

mbr_sector

Passed

N/A

0.076776s

include/sys/t_cdefs

0.948728s

sissigned

Passed

N/A

0.081347s

stypefit

Passed

N/A

0.084133s

stypemask

Passed

N/A

0.183392s

stypeminmax

Passed

N/A

0.145378s

uissigned

Passed

N/A

0.085105s

utypefit

Passed

N/A

0.082460s

utypemask

Passed

N/A

0.084811s

utypeminmax

Passed

N/A

0.101114s

include/sys/t_pslist

0.242111s

misc

Passed

N/A

0.184088s

include/sys/t_tree

1.798398s

tree_rbstress

Passed

N/A

1.781579s

include/sys/t_types

0.411926s

types_limits

Passed

N/A

0.083763s

types_signed

Passed

N/A

0.082823s

types_unsigned

Passed

N/A

0.176534s

include/sys/t_socket

2.349601s

cmsg_sendfd

Passed

N/A

0.817635s

cmsg_sendfd_bounds

Passed

N/A

0.729251s

sock_cloexec

Passed

N/A

0.680382s

include/t_bitstring

2.230242s

bits_27

Passed

N/A

0.391653s

bits_32

Passed

N/A

0.297354s

bits_49

Passed

N/A

0.357702s

bits_64

Passed

N/A

0.320356s

bits_67

Passed

N/A

0.368230s

bits_8

Passed

N/A

0.292289s

include/t_errno

0.103030s

errno_constants

Expected failure

PR standards/44921: 2 checks failed as expected; see output for more details

0.083699s

include/t_glob

0.165753s

glob_types

Passed

N/A

0.116659s

include/t_inttypes

0.100109s

int_fmtio

Passed

N/A

0.090214s

include/t_limits

0.451545s

char

Passed

N/A

0.075346s

posix

Passed

N/A

0.176000s

short

Passed

N/A

0.137600s

include/t_netdb

0.107227s

netdb_constants

Expected failure

PR standards/44777: 2 checks failed as expected; see output for more details

0.089332s

include/t_paths

0.214727s

paths

Passed

N/A

0.205893s

include/t_stdint

0.279460s

int16

Passed

N/A

0.147004s

int8

Passed

N/A

0.066213s

kernel/kqueue/read/t_fifo

0.112706s

fifo

Passed

N/A

0.100967s

kernel/kqueue/read/t_file

13.264522s

file

Passed

N/A

13.205748s

kernel/kqueue/read/t_file2

0.097812s

file2

Passed

N/A

0.083066s

kernel/kqueue/read/t_pipe

0.102175s

pipe

Passed

N/A

0.092712s

kernel/kqueue/read/t_ttypty

4.694474s

master

Passed

N/A

2.210910s

slave

Passed

N/A

2.419618s

kernel/kqueue/write/t_fifo

0.115162s

fifo

Passed

N/A

0.104326s

kernel/kqueue/write/t_pipe

0.432218s

pipe1

Passed

N/A

0.174649s

pipe2

Passed

N/A

0.100639s

pipe3

Passed

N/A

0.077711s

kernel/kqueue/write/t_ttypty

5.253961s

master

Passed

N/A

3.063514s

slave

Passed

N/A

2.144771s

kernel/kqueue/t_ioctl

0.205260s

kfilter_byfilter

Passed

N/A

0.091701s

kfilter_byname

Passed

N/A

0.090284s

kernel/kqueue/t_proc1

4.311561s

proc1

Passed

N/A

4.252500s

kernel/kqueue/t_proc2

4.049585s

proc2

Passed

N/A

4.032570s

kernel/kqueue/t_proc3

0.230257s

proc3

Passed

N/A

0.171705s

kernel/kqueue/t_sig

25.281098s

sig

Passed

N/A

25.271752s

kernel/kqueue/t_vnode

4.486533s

dir_no_note_link_create_file_in

Passed

N/A

0.338657s

dir_no_note_link_delete_file_in

Passed

N/A

0.185057s

dir_no_note_link_mv_dir_within

Passed

N/A

0.179317s

dir_no_note_link_mv_file_within

Passed

N/A

0.278428s

dir_note_link_create_dir_in

Passed

N/A

0.244281s

dir_note_link_delete_dir_in

Passed

N/A

0.171696s

dir_note_link_mv_dir_in

Passed

N/A

0.181318s

dir_note_link_mv_dir_out

Passed

N/A

0.355717s

dir_note_write_create_dir_in

Passed

N/A

0.184323s

dir_note_write_create_file_in

Passed

N/A

0.168165s

dir_note_write_delete_dir_in

Passed

N/A

0.263339s

dir_note_write_delete_file_in

Passed

N/A

0.245209s

dir_note_write_mv_dir_in

Passed

N/A

0.181642s

dir_note_write_mv_dir_out

Passed

N/A

0.177092s

dir_note_write_mv_dir_within

Passed

N/A

0.354465s

dir_note_write_mv_file_in

Passed

N/A

0.198207s

dir_note_write_mv_file_out

Passed

N/A

0.179226s

dir_note_write_mv_file_within

Passed

N/A

0.271347s

kernel/tty/t_pr

2.016141s

client_first

Passed

N/A

0.713001s

master_first

Passed

N/A

0.682317s

ptyioctl

Passed

N/A

0.498792s

kernel/t_lock

2.199292s

lock

Passed

N/A

2.137540s

kernel/t_lockf

125.618458s

deadlock

Passed

N/A

2.192121s

randlock

Passed

N/A

123.387769s

kernel/t_pty

12.987768s

pty_no_queue

Passed

N/A

6.340797s

pty_queue

Passed

N/A

6.594490s

kernel/t_mqueue

0.103059s

mqueue

Passed

N/A

0.089986s

kernel/t_sysv

3.078253s

msg

Passed

N/A

0.317645s

sem

Passed

N/A

2.262837s

shm

Passed

N/A

0.415347s

kernel/t_subr_prf

0.541393s

snprintf_count

Passed

N/A

0.094638s

snprintf_count_overflow

Passed

N/A

0.086589s

snprintf_print

Passed

N/A

0.085062s

snprintf_print_overflow

Passed

N/A

0.193224s

kernel/t_kauth_pr_47598

0.606471s

kauth_curtain

Passed

N/A

0.561774s

kernel/t_sysctl

0.144042s

bufsize

Passed

N/A

0.127347s

kernel/t_extattrctl

0.712612s

extattrctl_namei

Passed

N/A

0.653111s

kernel/t_filedesc

18.900472s

getfilerace

Passed

N/A

18.831327s

kernel/t_rnd

2.234900s

RNDADDDATA

Passed

N/A

0.716011s

RNDADDDATA2

Passed

N/A

0.682025s

read_random

Passed

N/A

0.671717s

kernel/t_extent

1.477671s

bound1

Passed

N/A

0.100661s

bound2

Passed

N/A

0.186909s

bound3

Passed

N/A

0.144796s

bound4

Passed

N/A

0.085902s

bound5

Passed

N/A

0.087005s

coalesce

Passed

N/A

0.090299s

free

Passed

N/A

0.086721s

subregion1

Passed

N/A

0.095611s

subregion2

Passed

N/A

0.189313s

subregion3

Passed

N/A

0.146170s

subregion4

Passed

N/A

0.091356s

kernel/t_umount

8.905115s

umount

Passed

N/A

8.758624s

kernel/t_umountstress

22.075038s

fileop

Failed

File operation failed

6.866388s

mountlist

Failed

Mountlist operation failed

15.045124s

kernel/t_ps_strings

6.049446s

update

Passed

N/A

4.759144s

validate

Passed

N/A

1.179603s

lib/csu/t_crt0

5.836631s

initfini1

Passed

N/A

1.364563s

initfini2

Passed

N/A

1.302337s

initfini3

Passed

N/A

1.414209s

initfini4

Passed

N/A

1.584537s

lib/libbluetooth/t_bluetooth

0.346793s

check_bt_aton

Passed

N/A

0.096637s

check_bt_ntoa

Passed

N/A

0.183296s

lib/libbluetooth/t_sdp_data

0.211210s

check_sdp_data_size

Passed

N/A

0.102032s

check_sdp_data_type

Passed

N/A

0.082109s

lib/libbluetooth/t_sdp_get

1.322185s

check_sdp_get_alt

Passed

N/A

0.088074s

check_sdp_get_attr

Passed

N/A

0.187897s

check_sdp_get_bool

Passed

N/A

0.151659s

check_sdp_get_data

Passed

N/A

0.086281s

check_sdp_get_int

Passed

N/A

0.086147s

check_sdp_get_seq

Passed

N/A

0.086982s

check_sdp_get_str

Passed

N/A

0.090404s

check_sdp_get_uint

Passed

N/A

0.088924s

check_sdp_get_url

Passed

N/A

0.088809s

check_sdp_get_uuid

Passed

N/A

0.198784s

lib/libbluetooth/t_sdp_match

0.120755s

check_sdp_match_uuid16

Passed

N/A

0.101216s

lib/libbluetooth/t_sdp_put

2.711044s

check_sdp_put_alt

Passed

N/A

0.090779s

check_sdp_put_attr

Passed

N/A

0.092692s

check_sdp_put_bool

Passed

N/A

0.206976s

check_sdp_put_data

Passed

N/A

0.142255s

check_sdp_put_int

Passed

N/A

0.091176s

check_sdp_put_int16

Passed

N/A

0.092659s

check_sdp_put_int32

Passed

N/A

0.093517s

check_sdp_put_int64

Passed

N/A

0.093688s

check_sdp_put_int8

Passed

N/A

0.094619s

check_sdp_put_seq

Passed

N/A

0.197885s

check_sdp_put_str

Passed

N/A

0.154838s

check_sdp_put_uint

Passed

N/A

0.091404s

check_sdp_put_uint16

Passed

N/A

0.091546s

check_sdp_put_uint32

Passed

N/A

0.089734s

check_sdp_put_uint64

Passed

N/A

0.087020s

check_sdp_put_uint8

Passed

N/A

0.092033s

check_sdp_put_url

Passed

N/A

0.185099s

check_sdp_put_uuid

Passed

N/A

0.157024s

check_sdp_put_uuid128

Passed

N/A

0.093028s

check_sdp_put_uuid16

Passed

N/A

0.088736s

check_sdp_put_uuid32

Passed

N/A

0.092047s

lib/libbluetooth/t_sdp_set

0.666634s

check_sdp_set_alt

Passed

N/A

0.189832s

check_sdp_set_bool

Passed

N/A

0.148871s

check_sdp_set_int

Passed

N/A

0.083426s

check_sdp_set_seq

Passed

N/A

0.080416s

check_sdp_set_uint

Passed

N/A

0.081636s

lib/libc/c063/t_faccessat

0.896653s

faccessat_fd

Passed

N/A

0.181263s

faccessat_fdcwd

Passed

N/A

0.150438s

faccessat_fdcwderr

Passed

N/A

0.083257s

faccessat_fderr1

Passed

N/A

0.085652s

faccessat_fderr2

Passed

N/A

0.088507s

faccessat_fderr3

Passed

N/A

0.087962s

faccessat_fdlink

Passed

N/A

0.091260s

lib/libc/c063/t_fchmodat

0.972464s

fchmodat_fd

Passed

N/A

0.162586s

fchmodat_fdcwd

Passed

N/A

0.081921s

fchmodat_fdcwderr

Passed

N/A

0.085714s

fchmodat_fderr1

Passed

N/A

0.086727s

fchmodat_fderr2

Passed

N/A

0.089473s

fchmodat_fderr3

Passed

N/A

0.092854s

fchmodat_fdlink

Passed

N/A

0.201256s

lib/libc/c063/t_fchownat

1.071303s

fchownat_fd

Passed

N/A

0.134096s

fchownat_fdcwd

Passed

N/A

0.110505s

fchownat_fdcwderr

Passed

N/A

0.102776s

fchownat_fderr1

Passed

N/A

0.232853s

fchownat_fderr2

Passed

N/A

0.156061s

fchownat_fderr3

Passed

N/A

0.102164s

fchownat_fdlink

Passed

N/A

0.109749s

lib/libc/c063/t_fexecve

0.339988s

fexecve

Expected failure

fexecve not implemented: /tmp/bracket/build/2016.06.15.04.33.52-i386/src/tests/lib/libc/c063/t_fexecve.c:85: access("test", F_OK) == 0 not met

0.254971s

lib/libc/c063/t_fstatat

0.900348s

fstatat_fd

Passed

N/A

0.087291s

fstatat_fdcwd

Passed

N/A

0.088983s

fstatat_fdcwderr

Passed

N/A

0.085746s

fstatat_fderr1

Passed

N/A

0.089335s

fstatat_fderr2

Passed

N/A

0.205873s

fstatat_fderr3

Passed

N/A

0.133320s

fstatat_fdlink

Passed

N/A

0.087347s

lib/libc/c063/t_linkat

0.860262s

linkat_fd

Passed

N/A

0.091148s

linkat_fdcwd

Passed

N/A

0.089137s

linkat_fdcwderr

Passed

N/A

0.188527s

linkat_fderr

Passed

N/A

0.156117s

linkat_fdlink1

Passed

N/A

0.096122s

linkat_fdlink2

Passed

N/A

0.089176s

lib/libc/c063/t_mkdirat

0.628867s

mkdirat_fd

Passed

N/A

0.089838s

mkdirat_fdcwd

Passed

N/A

0.152259s

mkdirat_fdcwderr

Passed

N/A

0.184026s

mkdirat_fderr

Passed

N/A

0.089307s

lib/libc/c063/t_mkfifoat

0.552669s

mkfifoat_fd

Passed

N/A

0.089261s

mkfifoat_fdcwd

Passed

N/A

0.089321s

mkfifoat_fdcwderr

Passed

N/A

0.086115s

mkfifoat_fderr

Passed

N/A

0.191347s

lib/libc/c063/t_mknodat

0.416935s

mknodat_fd

Passed

N/A

0.103883s

mknodat_fdcwd

Passed

N/A

0.089941s

mknodat_fdcwderr

Passed

N/A

0.085517s

mknodat_fderr

Passed

N/A

0.085782s

lib/libc/c063/t_o_search

0.463848s

o_search_notdir

Passed

N/A

0.163340s

o_search_perm1

Passed

N/A

0.121703s

o_search_perm2

Passed

N/A

0.089138s

lib/libc/c063/t_openat

3.352927s

openat_fd

Passed

N/A

0.089209s

openat_fdcwd

Failed

Test program received signal 11 (core dumped)

2.542829s

openat_fdcwderr

Passed

N/A

0.275843s

openat_fderr1

Passed

N/A

0.124242s

openat_fderr2

Passed

N/A

0.083095s

openat_fderr3

Passed

N/A

0.085721s

lib/libc/c063/t_readlinkat

0.634490s

readlinkat_fd

Passed

N/A

0.086978s

readlinkat_fdcwd

Passed

N/A

0.191742s

readlinkat_fdcwderr

Passed

N/A

0.125902s

readlinkat_fderr1

Passed

N/A

0.069678s

readlinkat_fderr2

Passed

N/A

0.059746s

lib/libc/c063/t_renameat

0.620897s

renameat_fd

Passed

N/A

0.070646s

renameat_fdcwd

Passed

N/A

0.209246s

renameat_fdcwderr

Passed

N/A

0.147779s

renameat_fderr

Passed

N/A

0.087949s

lib/libc/c063/t_symlinkat

0.637307s

symlinkat_fd

Passed

N/A

0.089313s

symlinkat_fdcwd

Passed

N/A

0.089294s

symlinkat_fdcwderr

Passed

N/A

0.184307s

symlinkat_fderr

Passed

N/A

0.158033s

lib/libc/c063/t_unlinkat

0.909535s

unlinkat_dir

Passed

N/A

0.090247s

unlinkat_fd

Passed

N/A

0.086914s

unlinkat_fdcwd

Passed

N/A

0.090131s

unlinkat_fdcwderr

Passed

N/A

0.088925s

unlinkat_fderr1

Passed

N/A

0.196853s

unlinkat_fderr2

Passed

N/A

0.142053s

unlinkat_fderr3

Passed

N/A

0.086529s

lib/libc/c063/t_utimensat

0.921089s

utimensat_fd

Passed

N/A

0.084497s

utimensat_fdcwd

Passed

N/A

0.088223s

utimensat_fdcwderr

Passed

N/A

0.153348s

utimensat_fderr1

Passed

N/A

0.173048s

utimensat_fderr2

Passed

N/A

0.089256s

utimensat_fderr3

Passed

N/A

0.090485s

utimensat_fdlink

Passed

N/A

0.092019s

lib/libc/db/t_db_hash_seq

0.636447s

test_hash_del_all

Passed

N/A

0.194662s

test_hash_del_alt

Passed

N/A

0.159816s

test_hash_del_every_7

Passed

N/A

0.097204s

test_hash_del_none

Passed

N/A

0.095440s

lib/libc/db/t_db

3240.124422s

alternate_recno

Passed

N/A

2.631402s

big_btree

Passed

N/A

6.128614s

big_hash

Passed

N/A

3.142557s

big_recno

Passed

N/A

6.468171s

bsize_ffactor

Passed

N/A

285.702631s

bsize_torture

Passed

N/A

2864.421562s

byte_orders_btree

Passed

N/A

2.991754s

byte_orders_hash

Passed

N/A

2.989115s

cursor_flags_btree

Passed

N/A

2.884082s

cursor_flags_recno

Passed

N/A

2.741015s

delete_btree

Passed

N/A

2.213685s

delete_recno

Passed

N/A

2.101271s

duplicate_btree

Passed

N/A

2.066467s

four_char_hash

Passed

N/A

1.271892s

medium_btree

Passed

N/A

1.714376s

medium_hash

Passed

N/A

1.701025s

medium_recno

Passed

N/A

1.537039s

random_recno

Passed

N/A

3.953586s

repeated_btree

Passed

N/A

1.732463s

repeated_hash

Passed

N/A

1.598700s

reverse_order_recno

Passed

N/A

2.036923s

reverse_recno

Passed

N/A

2.196907s

small_btree

Passed

N/A

1.615692s

small_hash

Failed

Test case exited normally but failed to create the results file: Failed to open /tmp/atf-run.LoZeZQ/tcr

0.970082s

small_page_btree

Passed

N/A

30.728666s

small_recno

Passed

N/A

1.527403s

lib/libc/gen/execve/t_execve

0.092632s

t_execve_null

Passed

N/A

0.062233s

lib/libc/gen/posix_spawn/t_spawn

0.574179s

t_spawn_child

Passed

N/A

0.109483s

t_spawn_ls

Passed

N/A

0.116536s

t_spawn_missing

Passed

N/A

0.070558s

t_spawn_nonexec

Passed

N/A

0.048145s

t_spawn_zero

Passed

N/A

0.072603s

t_spawnp_ls

Passed

N/A

0.108860s

lib/libc/gen/posix_spawn/t_fileactions

0.772845s

t_spawn_empty_fileactions

Passed

N/A

0.205406s

t_spawn_fileactions

Passed

N/A

0.070572s

t_spawn_open_nonexistent

Passed

N/A

0.048256s

t_spawn_open_nonexistent_diag

Passed

N/A

0.052149s

t_spawn_openmode

Passed

N/A

0.220274s

t_spawn_reopen

Passed

N/A

0.103950s

lib/libc/gen/posix_spawn/t_spawnattr

0.291175s

t_spawnattr

Passed

N/A

0.252590s

lib/libc/gen/t_alarm

2.303458s

alarm_basic

Passed

N/A

2.100702s

alarm_fork

Passed

N/A

0.087447s

alarm_previous

Passed

N/A

0.082157s

lib/libc/gen/t_assert

0.360987s

assert_false

Passed

N/A

0.159221s

assert_true

Passed

N/A

0.125817s

lib/libc/gen/t_basedirname

0.162573s

basename_posix

Passed

N/A

0.078652s

dirname_posix

Passed

N/A

0.067300s

lib/libc/gen/t_closefrom

0.608025s

closefrom_basic

Passed

N/A

0.216538s

closefrom_buffer

Passed

N/A

0.152405s

closefrom_err

Passed

N/A

0.078660s

closefrom_one

Passed

N/A

0.085688s

lib/libc/gen/t_cpuset

0.279643s

cpuset_err

Passed

N/A

0.113063s

cpuset_set

Passed

N/A

0.053818s

cpuset_size

Passed

N/A

0.047588s

lib/libc/gen/t_dir

0.421834s

seekdir_basic

Passed

N/A

0.087440s

telldir_leak

Passed

N/A

0.285644s

lib/libc/gen/t_floatunditf

0.173876s

floatunditf

Passed

N/A

0.158362s

lib/libc/gen/t_fmtcheck

0.219232s

fmtcheck_basic

Passed

N/A

0.167319s

lib/libc/gen/t_fnmatch

0.852248s

fnmatch_backslashes

Passed

N/A

0.097943s

fnmatch_casefold

Passed

N/A

0.081066s

fnmatch_initialbracket

Passed

N/A

0.082596s

fnmatch_leadingdir

Passed

N/A

0.081889s

fnmatch_noescape

Passed

N/A

0.082824s

fnmatch_pathname

Passed

N/A

0.193060s

fnmatch_period

Passed

N/A

0.132705s

lib/libc/gen/t_fpclassify

0.454413s

fpclassify_double

Passed

N/A

0.169205s

fpclassify_float

Passed

N/A

0.205458s

lib/libc/gen/t_fpsetmask

1.287687s

fpsetmask_basic

Passed

N/A

0.066104s

fpsetmask_masked_double

Expected failure

PR misc/44767: 3 checks failed as expected; see output for more details

0.265062s

fpsetmask_masked_float

Expected failure

PR misc/44767: 3 checks failed as expected; see output for more details

0.174565s

fpsetmask_masked_long_double

Expected failure

PR misc/44767: 3 checks failed as expected; see output for more details

0.104911s

fpsetmask_unmasked_double

Expected failure

PR misc/44767: 8 checks failed as expected; see output for more details

0.117344s

fpsetmask_unmasked_float

Expected failure

PR misc/44767: 8 checks failed as expected; see output for more details

0.274508s

fpsetmask_unmasked_long_double

Expected failure

PR misc/44767: 8 checks failed as expected; see output for more details

0.157064s

lib/libc/gen/t_fpsetround

0.166858s

fpsetround_basic

Passed

N/A

0.127535s

lib/libc/gen/t_ftok

0.316728s

ftok_err

Passed

N/A

0.057443s

ftok_link

Passed

N/A

0.191324s

lib/libc/gen/t_getcwd

0.465396s

getcwd_err

Passed

N/A

0.092672s

getcwd_fts

Passed

N/A

0.351449s

lib/libc/gen/t_getgrent

0.791678s

getgrent_loop

Passed

N/A

0.210171s

getgrent_setgid

Passed

N/A

0.528787s

lib/libc/gen/t_glob

0.184876s

glob_star

Passed

N/A

0.084047s

glob_star_not

Passed

N/A

0.078943s

lib/libc/gen/t_humanize_number

0.375965s

humanize_number_basic

Passed

N/A

0.185149s

humanize_number_big

Passed

N/A

0.132967s

lib/libc/gen/t_isnan

0.423992s

isinf_basic

Passed

N/A

0.149469s

isnan_basic

Passed

N/A

0.195943s

lib/libc/gen/t_nice

0.781053s

nice_err

Passed

N/A

0.130390s

nice_priority

Passed

N/A

0.218869s

nice_root

Passed

N/A

0.199211s

nice_thread

Passed

N/A

0.150311s

lib/libc/gen/t_pause

6.191680s

pause_basic

Passed

N/A

2.069182s

pause_kill

Passed

N/A

4.101841s

lib/libc/gen/t_raise

3.358347s

raise_err

Passed

N/A

0.089908s

raise_ret

Passed

N/A

2.152002s

raise_sig

Passed

N/A

0.270432s

raise_stress

Passed

N/A

0.789258s

lib/libc/gen/t_randomid

1.712391s

randomid_basic

Passed

N/A

1.673647s

lib/libc/gen/t_realpath

0.292209s

realpath_basic

Passed

N/A

0.100708s

realpath_huge

Passed

N/A

0.076071s

realpath_symlink

Passed

N/A

0.085271s

lib/libc/gen/t_setdomainname

0.681595s

setdomainname_basic

Passed

N/A

0.289689s

setdomainname_limit

Passed

N/A

0.163044s

setdomainname_perm

Passed

N/A

0.166282s

lib/libc/gen/t_sethostname

0.593893s

sethostname_basic

Passed

N/A

0.223068s

sethostname_limit

Passed

N/A

0.151225s

sethostname_perm

Passed

N/A

0.149723s

lib/libc/gen/t_siginfo

7.427952s

sigalarm

Passed

N/A

2.220563s

sigbus_adraln

Expected failure

QEMU fails to trap unaligned accesses: Test did not fault as expected

0.138794s

sigchild_dump

Passed

N/A

2.403200s

sigchild_kill

Passed

N/A

0.097813s

sigchild_normal

Passed

N/A

2.067396s

sigfpe_flt

Skipped

Test does not run correctly under QEMU

0.125379s

sigfpe_int

Passed

N/A

0.142038s

sigsegv

Passed

N/A

0.080590s

lib/libc/gen/t_sleep

211.550390s

kevent

Failed

/tmp/bracket/build/2016.06.15.04.33.52-i386/src/tests/lib/libc/gen/t_sleep.c:180: kevent: KEVNT_TIMEOUT did not cause EVFILT_TIMER event

54.344529s

nanosleep

Expected failure

Long reschedule latency due to PR kern/43997: Reschedule latency -41386001 exceeds allowable fuzz 40000000

0.208892s

poll

Passed

N/A

75.430435s

select

Passed

N/A

79.152956s

sleep

Expected failure

Long reschedule latency due to PR kern/43997: Reschedule latency -1000000000 exceeds allowable fuzz 40000000

2.250479s

lib/libc/gen/t_syslog

0.140883s

syslog_pthread

Passed

N/A

0.124308s

lib/libc/gen/t_time

20.733830s

time_copy

Passed

N/A

0.101497s

time_mono

Passed

N/A

20.519873s

time_timeofday

Passed

N/A

0.079792s

lib/libc/gen/t_ttyname

0.617362s

ttyname_err

Passed

N/A

0.128972s

ttyname_r_err

Passed

N/A

0.194047s

ttyname_r_stdin

Passed

N/A

0.153333s

ttyname_stdin

Passed

N/A

0.081608s

lib/libc/gen/t_vis

0.712152s

strunvis_hex

Passed

N/A

0.080247s

strvis_basic

Passed

N/A

0.204579s

strvis_empty

Passed

N/A

0.139767s

strvis_locale

Passed

N/A

0.120933s

strvis_null

Passed

N/A

0.081153s

lib/libc/hash/t_sha2

0.533127s

t_sha256

Passed

N/A

0.178336s

t_sha384

Passed

N/A

0.172449s

t_sha512

Passed

N/A

0.110053s

lib/libc/hash/t_hash

9.451866s

md5

Passed

N/A

1.276156s

sha1

Passed

N/A

8.080289s

lib/libc/inet/t_inet_addr

0.392645s

inet_addr_basic

Passed

N/A

0.240110s

inet_addr_err

Passed

N/A

0.104749s

lib/libc/inet/t_inet_network

0.203617s

inet_network_basic

Passed

N/A

0.097353s

inet_network_err

Passed

N/A

0.081521s

lib/libc/locale/t_mbrtowc

0.483678s

mbrtowc_internal

Passed

N/A

0.258528s

mbrtowc_object

Passed

N/A

0.162504s

lib/libc/locale/t_mbstowcs

0.298067s

mbstowcs_basic

Passed

N/A

0.269378s

lib/libc/locale/t_mbsnrtowcs

0.072768s

mbsnrtowcs

Passed

N/A

0.063698s

lib/libc/locale/t_mbtowc

0.388214s

mbtowc

Passed

N/A

0.352559s

lib/libc/locale/t_wcscspn

0.111443s

wcscspn

Passed

N/A

0.094163s

lib/libc/locale/t_wcspbrk

0.088816s

wcspbrk

Passed

N/A

0.078211s

lib/libc/locale/t_wcsspn

0.085697s

wcsspn

Passed

N/A

0.076211s

lib/libc/locale/t_wcstod

3.423514s

wcstod

Passed

N/A

3.369044s

lib/libc/locale/t_wctomb

0.507961s

wcrtomb

Passed

N/A

0.204868s

wcrtomb_state

Passed

N/A

0.119684s

wctomb

Passed

N/A

0.115463s

lib/libc/locale/t_io

0.971405s

bad_big5_getwc

Passed

N/A

0.209238s

bad_big5_swprintf

Passed

N/A

0.158860s

bad_big5_wprintf

Passed

N/A

0.098595s

good_big5_getwc

Passed

N/A

0.095630s

good_big5_swprintf

Passed

N/A

0.096392s

good_big5_wprintf

Passed

N/A

0.175474s

lib/libc/net/getaddrinfo/t_getaddrinfo

10.322794s

basic

Passed

N/A

1.898561s

empty_hostname

Passed

N/A

1.872460s

empty_servname

Passed

N/A

1.425258s

scopeaddr

Passed

N/A

0.895860s

sock_raw

Passed

N/A

1.467823s

specific

Passed

N/A

1.352148s

unsupported_family

Passed

N/A

0.995201s

lib/libc/net/t_getprotoent

0.930392s

endprotoent_rewind

Passed

N/A

0.102407s

getprotobyname_basic

Passed

N/A

0.096492s

getprotobyname_err

Passed

N/A

0.219710s

getprotobynumber_basic

Passed

N/A

0.154589s

getprotobynumber_err

Passed

N/A

0.095876s

getprotoent_next

Passed

N/A

0.083915s

setprotoent_rewind

Passed

N/A

0.083772s

lib/libc/net/t_ether_aton

0.240536s

tc_ether_aton

Passed

N/A

0.187444s

lib/libc/net/t_nsdispatch

1.395858s

recurse

Passed

N/A

1.332264s

lib/libc/net/t_protoent

1.713630s

protoent

Passed

N/A

1.633573s

lib/libc/net/t_servent

11.364989s

servent

Passed

N/A

11.254511s

lib/libc/net/t_hostent

37.745019s

dnsbyaddrlookup4

Passed

N/A

4.711568s

dnsbyaddrlookup6

Passed

N/A

4.439335s

dnsbynamelookup4

Passed

N/A

3.115542s

dnsbynamelookup6

Passed

N/A

4.149713s

gethostbyaddr4

Passed

N/A

4.439578s

gethostbyaddr6

Passed

N/A

3.475575s

gethostbyname4

Passed

N/A

3.711834s

gethostbyname6

Passed

N/A

3.443312s

hostsbyaddrlookup4

Passed

N/A

1.362138s

hostsbyaddrlookup6

Passed

N/A

1.426548s

hostsbynamelookup4

Passed

N/A

1.441931s

hostsbynamelookup6

Passed

N/A

1.447526s

lib/libc/regex/t_regex_att

1.534767s

basic

Passed

N/A

0.361679s

categorization

Passed

N/A

0.185550s

forcedassoc

Passed

N/A

0.122370s

leftassoc

Expected failure

Reason for breakage unknown: /tmp/bracket/build/2016.06.15.04.33.52-i386/src/tests/lib/libc/regex/t_regex_att.c:377: res != matches ((0,4)(0,2)(2,3)(3,4) != (0,4)(0,1)(1,4)(4,4)): at line 3

0.100942s

nullsubexpr

Passed

N/A

0.163861s

repetition

Passed

N/A

0.317573s

rightassoc

Passed

N/A

0.159174s

lib/libc/regex/t_exhaust

0.023213s

regcomp_too_big

Skipped

Not enough memory; needed 125829120, available 41521152

0.010517s

lib/libc/regex/t_regex

39.463658s

anchor

Passed

N/A

2.378139s

backref

Failed

atf-check failed; see the output of the test for details

1.103817s

basic

Passed

N/A

2.349044s

bracket

Passed

N/A

2.846713s

c_comments

Passed

N/A

2.293250s

complex

Passed

N/A

2.106934s

error

Passed

N/A

2.470480s

meta

Passed

N/A

2.328247s

nospec

Passed

N/A

2.330327s

paren

Passed

N/A

1.736196s

regress

Passed

N/A

1.324993s

repet_bounded

Passed

N/A

1.925238s

repet_multi

Passed

N/A

1.615174s

repet_ordinary

Passed

N/A

1.591834s

startend

Passed

N/A

1.568957s

subexp

Passed

N/A

2.215284s

subtle

Passed

N/A

2.262416s

word_bound

Passed

N/A

2.254134s

zero

Passed

N/A

2.074559s

lib/libc/rpc/t_xdr

0.209631s

xdr

Passed

N/A

0.177805s

lib/libc/rpc/t_rpc

4.005525s

get_svc_addr_tcp

Skipped

clnt_create (: RPC: Port mapper failure - RPC: Timed out)

1.517532s

get_svc_addr_udp

Skipped

clnt_create (: RPC: Port mapper failure - RPC: Timed out)

1.414644s

raw

Passed

N/A

0.088300s

tcp

Failed

/tmp/bracket/build/2016.06.15.04.33.52-i386/src/tests/lib/libc/rpc/t_rpc.c:179: Cannot create server 1

0.371286s

tcp_poll

Failed

/tmp/bracket/build/2016.06.15.04.33.52-i386/src/tests/lib/libc/rpc/t_rpc.c:179: Cannot create server 1

0.195344s

udp

Failed

/tmp/bracket/build/2016.06.15.04.33.52-i386/src/tests/lib/libc/rpc/t_rpc.c:179: Cannot create server 1

0.145138s

udp_poll

Failed

/tmp/bracket/build/2016.06.15.04.33.52-i386/src/tests/lib/libc/rpc/t_rpc.c:179: Cannot create server 1

0.143274s

lib/libc/setjmp/t_setjmp

0.453011s

_setjmp

Passed

N/A

0.111558s

setjmp

Passed

N/A

0.084368s

sigsetjmp_nosave

Passed

N/A

0.088975s

sigsetjmp_save

Passed

N/A

0.084991s

lib/libc/setjmp/t_threadjmp

0.495150s

_setjmp

Passed

N/A

0.181355s

setjmp

Passed

N/A

0.071993s

sigsetjmp_nosave

Passed

N/A

0.082017s

sigsetjmp_save

Passed

N/A

0.075285s

lib/libc/stdlib/t_abs

0.478438s

abs_basic

Passed

N/A

0.152121s

imaxabs_basic

Passed

N/A

0.080331s

labs_basic

Passed

N/A

0.080049s

llabs_basic

Passed

N/A

0.081326s

lib/libc/stdlib/t_atoi

0.681946s

atof_strtod

Passed

N/A

0.228479s

atoi_strtol

Passed

N/A

0.192818s

atol_strtol

Passed

N/A

0.082512s

atoll_strtoll

Passed

N/A

0.084903s

lib/libc/stdlib/t_div

0.418397s

div_basic

Passed

N/A

0.174557s

ldiv_basic

Passed

N/A

0.076684s

lldiv_basic

Passed

N/A

0.087487s

lib/libc/stdlib/t_getenv

68.190427s

clearenv_basic

Passed

N/A

0.419220s

getenv_basic

Passed

N/A

0.084551s

putenv_basic

Passed

N/A

0.248803s

setenv_basic

Passed

N/A

67.268032s

setenv_mixed

Passed

N/A

0.084783s

lib/libc/stdlib/t_getenv_thread

39.438724s

getenv_r_thread

Passed

N/A

9.408207s

putenv_thread

Passed

N/A

9.955317s

setenv_thread

Passed

N/A

9.991771s

unsetenv_thread

Passed

N/A

9.997043s

lib/libc/stdlib/t_exit

0.626786s

exit_atexit

Passed

N/A

0.165063s

exit_basic

Passed

N/A

0.086779s

exit_status

Passed

N/A

0.148038s

exit_tmpfile

Passed

N/A

0.144479s

lib/libc/stdlib/t_hsearch

1.102838s

hsearch_basic

Passed

N/A

0.171105s

hsearch_duplicate

Passed

N/A

0.083204s

hsearch_nonexistent

Passed

N/A

0.086892s

hsearch_r_basic

Passed

N/A

0.090610s

hsearch_r_duplicate

Passed

N/A

0.091042s

hsearch_r_nonexistent

Passed

N/A

0.184183s

hsearch_r_two

Passed

N/A

0.156139s

hsearch_two

Passed

N/A

0.083663s

lib/libc/stdlib/t_mi_vector_hash

0.085342s

mi_vector_hash_basic

Passed

N/A

0.071602s

lib/libc/stdlib/t_posix_memalign

0.428889s

aligned_alloc_basic

Passed

N/A

0.213856s

posix_memalign_basic

Passed

N/A

0.168212s

lib/libc/stdlib/t_random

0.162725s

random_same

Passed

N/A

0.145531s

lib/libc/stdlib/t_strtod

2.018007s

strtod_basic

Passed

N/A

0.261605s

strtod_gherman_bug

Passed

N/A

0.174668s

strtod_hex

Passed

N/A

0.098108s

strtod_inf

Passed

N/A

0.094070s

strtod_nan

Passed

N/A

0.246743s

strtod_round

Passed

N/A

0.164833s

strtod_underflow

Passed

N/A

0.099035s

strtof_inf

Passed

N/A

0.098918s

strtof_nan

Passed

N/A

0.256009s

strtold_inf

Passed

N/A

0.161246s

strtold_nan

Passed

N/A

0.098277s

lib/libc/stdlib/t_strtol

0.508619s

strtol_base

Passed

N/A

0.174939s

strtol_case

Passed

N/A

0.081165s

strtol_range

Passed

N/A

0.081210s

strtol_signed

Passed

N/A

0.085018s

lib/libc/stdlib/t_strtoi

0.564544s

strtoi_base

Passed

N/A

0.082510s

strtoi_case

Passed

N/A

0.187021s

strtoi_range

Passed

N/A

0.142907s

strtoi_signed

Passed

N/A

0.081242s

lib/libc/stdlib/t_system

0.905280s

system_basic

Passed

N/A

0.797714s

lib/libc/stdlib/t_atexit

1.104552s

atexit

Passed

N/A

1.023944s

lib/libc/stdlib/t_getopt

10.047825s

getopt

Passed

N/A

5.502676s

getopt_long

Passed

N/A

4.414299s

lib/libc/stdio/t_clearerr

0.219808s

clearerr_basic

Passed

N/A

0.113252s

clearerr_err

Passed

N/A

0.081460s

lib/libc/stdio/t_fflush

0.700120s

fflush_err

Passed

N/A

0.230605s

fflush_seek

Passed

N/A

0.233912s

fpurge_err

Passed

N/A

0.149133s

lib/libc/stdio/t_fmemopen

4.047755s

test00

Passed

N/A

0.201610s

test01

Passed

N/A

0.144958s

test02

Passed

N/A

0.103812s

test03

Passed

N/A

0.089776s

test04

Passed

N/A

0.091965s

test05

Passed

N/A

0.085678s

test06

Passed

N/A

0.085482s

test07

Passed

N/A

0.200778s

test08

Passed

N/A

0.144459s

test09

Passed

N/A

0.208423s

test10

Passed

N/A

0.188748s

test11

Passed

N/A

0.178251s

test12

Passed

N/A

0.136815s

test13

Passed

N/A

0.236448s

test14

Passed

N/A

0.203836s

test15

Passed

N/A

0.150945s

test16

Passed

N/A

0.093828s

test17

Passed

N/A

0.123021s

test18

Passed

N/A

0.094219s

test19

Passed

N/A

0.293056s

test20

Passed

N/A

0.185715s

test21

Passed

N/A

0.131855s

test22

Passed

N/A

0.311142s

lib/libc/stdio/t_fopen

2.330709s

fdopen_close

Passed

N/A

0.239388s

fdopen_err

Passed

N/A

0.282973s

fdopen_seek

Passed

N/A

0.163270s

fopen_append

Passed

N/A

0.252650s

fopen_err

Passed

N/A

0.248526s

fopen_mode

Passed

N/A

0.166320s

fopen_perm

Passed

N/A

0.109709s

fopen_regular

Passed

N/A

0.084461s

fopen_seek

Passed

N/A

0.329350s

freopen_std

Passed

N/A

0.227626s

lib/libc/stdio/t_open_memstream

0.105049s

test_open_memstream

Passed

N/A

0.089521s

lib/libc/stdio/t_fputc

1.333748s

fputc_basic

Passed

N/A

0.234810s

fputc_err

Passed

N/A

0.162204s

putc_basic

Passed

N/A

0.238340s

putc_err

Passed

N/A

0.229678s

putc_unlocked_basic

Passed

N/A

0.163308s

putc_unlocked_err

Passed

N/A

0.157723s

lib/libc/stdio/t_mktemp

0.209723s

mktemp_not_exist

Passed

N/A

0.151951s

lib/libc/stdio/t_popen

1.427100s

popen_zeropad

Passed

N/A

1.385370s

lib/libc/stdio/t_printf

4.569453s

snprintf_c99

Passed

N/A

0.227994s

snprintf_dotzero

Passed

N/A

0.221202s

snprintf_float

Passed

N/A

3.407825s

snprintf_posarg

Passed

N/A

0.086417s

snprintf_posarg_error

Passed

N/A

0.086579s

snprintf_posarg_width

Passed

N/A

0.205753s

sprintf_zeropad

Passed

N/A

0.207816s

lib/libc/stdio/t_scanf

0.335900s

sscanf_neghex

Passed

N/A

0.083011s

sscanf_whitespace

Passed

N/A

0.191135s

lib/libc/string/t_bm

0.120461s

bm

Passed

N/A

0.102935s

lib/libc/string/t_memchr

0.488414s

memchr_basic

Passed

N/A

0.081687s

memchr_simple

Passed

N/A

0.186934s

memrchr_simple

Passed

N/A

0.150185s

lib/libc/string/t_memcpy

22.779245s

memccpy_simple

Passed

N/A

0.083190s

memcpy_basic

Passed

N/A

22.584907s

memcpy_return

Passed

N/A

0.078755s

lib/libc/string/t_memmem

0.218362s

memmem_basic

Passed

N/A

0.161211s

lib/libc/string/t_memset

0.839972s

bzero_zero_size

Passed

N/A

0.081702s

memset_array

Passed

N/A

0.079596s

memset_basic

Passed

N/A

0.082312s

memset_nonzero

Passed

N/A

0.198353s

memset_return

Passed

N/A

0.142762s

memset_struct

Passed

N/A

0.081356s

memset_zero_size

Passed

N/A

0.080629s

lib/libc/string/t_popcount

0.330653s

popcount_basic

Skipped

config variable "run_popcount" not set to YES/TRUE

0.078797s

popcountll_basic

Skipped

config variable "run_popcount" not set to YES/TRUE

0.179653s

lib/libc/string/t_strcat

0.222017s

strcat_basic

Passed

N/A

0.120469s

strncat_simple

Passed

N/A

0.079913s

lib/libc/string/t_strchr

0.081252s

strchr_basic

Passed

N/A

0.073154s

lib/libc/string/t_strcmp

0.297816s

strcmp_basic

Passed

N/A

0.156082s

strcmp_simple

Passed

N/A

0.078022s

lib/libc/string/t_strcpy

0.082455s

strcpy_basic

Passed

N/A

0.070824s

lib/libc/string/t_strcspn

0.085651s

strcspn

Passed

N/A

0.076636s

lib/libc/string/t_strerror

0.774873s

strerror_basic

Passed

N/A

0.300714s

strerror_err

Passed

N/A

0.083725s

strerror_r_basic

Passed

N/A

0.219749s

strerror_r_err

Passed

N/A

0.090479s

lib/libc/string/t_stresep

0.232205s

stresep_basic

Passed

N/A

0.165254s

lib/libc/string/t_strlen

0.847033s

strlen_basic

Passed

N/A

0.079138s

strlen_huge

Passed

N/A

0.648928s

strnlen_basic

Passed

N/A

0.083666s

lib/libc/string/t_strpbrk

0.213721s

strpbrk

Passed

N/A

0.153299s

lib/libc/string/t_strrchr

0.087617s

strrchr_basic

Passed

N/A

0.076900s

lib/libc/string/t_strspn

0.092499s

strspn

Passed

N/A

0.079523s

lib/libc/string/t_swab

0.210507s

swab_basic

Passed

N/A

0.152351s

lib/libc/sys/t_access

0.718548s

access_access

Passed

N/A

0.183588s

access_fault

Passed

N/A

0.076712s

access_inval

Passed

N/A

0.177418s

access_notdir

Passed

N/A

0.096045s

access_notexist

Passed

N/A

0.054166s

access_toolong

Passed

N/A

0.054748s

lib/libc/sys/t_bind

0.095255s

bind_foreign_family

Passed

N/A

0.081092s

lib/libc/sys/t_chroot

0.918698s

chroot_basic

Passed

N/A

0.174085s

chroot_err

Passed

N/A

0.084418s

chroot_perm

Passed

N/A

0.103824s

fchroot_basic

Passed

N/A

0.089952s

fchroot_err

Passed

N/A

0.095428s

fchroot_perm

Passed

N/A

0.234495s

lib/libc/sys/t_clock_gettime

29.510963s

clock_gettime_real

Passed

N/A

29.461602s

lib/libc/sys/t_clone

0.646502s

clone_basic

Passed

N/A

0.117308s

clone_null_func

Passed

N/A

0.086168s

clone_null_stack

Passed

N/A

0.189842s

clone_out_of_proc

Passed

N/A

0.168829s

lib/libc/sys/t_connect

0.224268s

connect_foreign_family

Passed

N/A

0.086311s

connect_low_port

Passed

N/A

0.115384s

lib/libc/sys/t_dup

1.822965s

dup2_basic

Passed

N/A

0.163849s

dup2_err

Passed

N/A

0.087556s

dup2_max

Passed

N/A

0.083269s

dup2_mode

Passed

N/A

0.186584s

dup3_err

Passed

N/A

0.151927s

dup3_max

Passed

N/A

0.165017s

dup3_mode

Passed

N/A

0.188696s

dup_err

Passed

N/A

0.088830s

dup_max

Passed

N/A

0.180518s

dup_mode

Passed

N/A

0.267291s

lib/libc/sys/t_fsync

0.242067s

fsync_err

Passed

N/A

0.099449s

fsync_sync

Passed

N/A

0.116643s

lib/libc/sys/t_getcontext

0.483080s

getcontext_err

Passed

N/A

0.086396s

setcontext_err

Passed

N/A

0.183186s

setcontext_link

Passed

N/A

0.144523s

lib/libc/sys/t_getgroups

0.551742s

getgroups_err

Passed

N/A

0.083703s

getgroups_getgid

Passed

N/A

0.082028s

getgroups_setgid

Passed

N/A

0.118151s

getgroups_zero

Passed

N/A

0.188078s

lib/libc/sys/t_getitimer

0.607863s

getitimer_empty

Passed

N/A

0.102595s

getitimer_err

Passed

N/A

0.081040s

setitimer_basic

Passed

N/A

0.119989s

setitimer_err

Passed

N/A

0.085262s

setitimer_old

Passed

N/A

0.129380s

lib/libc/sys/t_getlogin

0.678625s

getlogin_r_err

Passed

N/A

0.105622s

getlogin_same

Passed

N/A

0.081551s

setlogin_basic

Passed

N/A

0.089160s

setlogin_err

Passed

N/A

0.090603s

setlogin_perm

Passed

N/A

0.222301s

lib/libc/sys/t_getpid

2.594342s

getpid_process

Passed

N/A

0.168482s

getpid_thread

Failed

Test program received signal 11 (core dumped)

2.347820s

lib/libc/sys/t_getrusage

6.155470s

getrusage_err

Passed

N/A

0.120058s

getrusage_sig

Passed

N/A

0.080317s

getrusage_utime_back

Expected failure

PR kern/30115: user time went backwards

0.821721s

getrusage_utime_zero

Expected failure

PR kern/30115: anticipated error did not occur

5.090879s

lib/libc/sys/t_getsid

0.411385s

getsid_current

Passed

N/A

0.161247s

getsid_err

Passed

N/A

0.086145s

getsid_process

Passed

N/A

0.087771s

lib/libc/sys/t_gettimeofday

0.313435s

gettimeofday_err

Passed

N/A

0.078832s

gettimeofday_mono

Passed

N/A

0.154712s

lib/libc/sys/t_issetugid

0.653211s

issetugid_egid

Passed

N/A

0.133468s

issetugid_euid

Passed

N/A

0.109980s

issetugid_rgid

Passed

N/A

0.108355s

issetugid_ruid

Passed

N/A

0.225608s

lib/libc/sys/t_kevent

0.398508s

kevent_zerotimer

Passed

N/A

0.123336s

kqueue_desc_passing

Skipped

PR kern/46523

0.115680s

kqueue_unsupported_fd

Passed

N/A

0.128211s

lib/libc/sys/t_kill

2.787913s

kill_basic

Passed

N/A

0.137453s

kill_err

Passed

N/A

0.081363s

kill_perm

Passed

N/A

2.140756s

kill_pgrp_neg

Passed

N/A

0.094746s

kill_pgrp_zero

Passed

N/A

0.206428s

lib/libc/sys/t_link

0.870866s

link_count

Passed

N/A

0.186767s

link_err

Passed

N/A

0.161980s

link_perm

Passed

N/A

0.222625s

link_stat

Passed

N/A

0.211427s

lib/libc/sys/t_listen

0.518391s

listen_err

Passed

N/A

0.272500s

listen_low_port

Passed

N/A

0.161544s

lib/libc/sys/t_lwp_ctl

0.149806s

lwpctl_counter

Passed

N/A

0.131875s

lib/libc/sys/t_lwp_create

0.566145s

lwp_create_generic_fail_no_uc_cpu

Passed

N/A

0.079680s

lwp_create_i386_fail_priv_escalation

Passed

N/A

0.195352s

lwp_create_i386_fail_untouchable_eflags

Passed

N/A

0.133196s

lwp_create_works

Passed

N/A

0.082509s

lib/libc/sys/t_minherit

0.699958s

minherit_bad

Passed

N/A

0.082615s

minherit_copy

Passed

N/A

0.092774s

minherit_none

Passed

N/A

0.208278s

minherit_share

Passed

N/A

0.143540s

minherit_zero

Passed

N/A

0.090865s

lib/libc/sys/t_mincore

1.036251s

mincore_err

Passed

N/A

0.086988s

mincore_resid

Passed

N/A

0.727059s

mincore_shmseg

Passed

N/A

0.151301s

lib/libc/sys/t_mkdir

2.812006s

mkdir_err

Passed

N/A

0.085311s

mkdir_mode

Passed

N/A

2.347999s

mkdir_perm

Passed

N/A

0.196759s

mkdir_trail

Passed

N/A

0.109425s

lib/libc/sys/t_mkfifo

5.842510s

mkfifo_block

Passed

N/A

2.784988s

mkfifo_err

Passed

N/A

0.158921s

mkfifo_nonblock

Passed

N/A

2.221705s

mkfifo_perm

Passed

N/A

0.348715s

mkfifo_stat

Passed

N/A

0.171273s

lib/libc/sys/t_mknod

0.905122s

mknod_err

Passed

N/A

0.245760s

mknod_exist

Passed

N/A

0.232205s

mknod_perm

Passed

N/A

0.156841s

mknod_stat

Passed

N/A

0.156244s

lib/libc/sys/t_mlock

0.647016s

mlock_clip

Passed

N/A

0.153282s

mlock_err

Passed

N/A

0.092295s

mlock_limits

Passed

N/A

0.151204s

mlock_mmap

Passed

N/A

0.080429s

mlock_nested

Passed

N/A

0.082703s

lib/libc/sys/t_mmap

1.747545s

mmap_block

Skipped

The test case causes a panic (PR kern/38889, kern/46592)

0.133814s

mmap_err

Passed

N/A

0.085156s

mmap_loan

Passed

N/A

0.181140s

mmap_prot_1

Passed

N/A

0.332988s

mmap_prot_2

Passed

N/A

0.108766s

mmap_prot_3

Passed

N/A

0.148870s

mmap_truncate

Passed

N/A

0.135339s

mmap_truncate_signal

Passed

N/A

0.351774s

mmap_va0

Passed

N/A

0.105480s

lib/libc/sys/t_mprotect

0.780165s

mprotect_access

Passed

N/A

0.159882s

mprotect_err

Passed

N/A

0.192953s

mprotect_exec

Skipped

PaX MPROTECT restrictions enabled

0.148690s

mprotect_pax

Passed

N/A

0.090614s

mprotect_write

Passed

N/A

0.087877s

lib/libc/sys/t_msgctl

5.587707s

msgctl_err

Passed

N/A

0.234152s

msgctl_perm

Passed

N/A

0.261439s

msgctl_pid

Passed

N/A

4.440498s

msgctl_set

Passed

N/A

0.263167s

msgctl_time

Passed

N/A

0.232056s

lib/libc/sys/t_msgget

0.995885s

msgget_excl

Passed

N/A

0.159566s

msgget_exit

Passed

N/A

0.317308s

msgget_init

Passed

N/A

0.164550s

msgget_limit

Passed

N/A

0.116219s

msgget_mode

Passed

N/A

0.153714s

lib/libc/sys/t_msgrcv

9.644124s

msgrcv_basic

Passed

N/A

0.216959s

msgrcv_block

Passed

N/A

4.448560s

msgrcv_err

Passed

N/A

0.227947s

msgrcv_mtype

Passed

N/A

0.224960s

msgrcv_nonblock

Passed

N/A

4.209429s

msgrcv_truncate

Passed

N/A

0.161466s

lib/libc/sys/t_msgsnd

9.472997s

msgsnd_block

Passed

N/A

4.273814s

msgsnd_count

Passed

N/A

0.155707s

msgsnd_err

Passed

N/A

0.245575s

msgsnd_nonblock

Passed

N/A

4.460102s

msgsnd_perm

Passed

N/A

0.183686s

lib/libc/sys/t_msync

0.943388s

msync_async

Passed

N/A

0.293953s

msync_err

Passed

N/A

0.241572s

msync_invalidate

Passed

N/A

0.167877s

msync_sync

Passed

N/A

0.168003s

lib/libc/sys/t_nanosleep

2.854570s

nanosleep_basic

Passed

N/A

0.506757s

nanosleep_err

Passed

N/A

0.145953s

nanosleep_sig

Passed

N/A

2.136284s

lib/libc/sys/t_pipe

4.627476s

pipe_restart

Passed

N/A

4.611838s

lib/libc/sys/t_pipe2

0.767465s

pipe2_basic

Passed

N/A

0.179010s

pipe2_cloexec

Passed

N/A

0.149894s

pipe2_consume

Passed

N/A

0.082338s

pipe2_einval

Passed

N/A

0.079170s

pipe2_nonblock

Passed

N/A

0.082957s

pipe2_nosigpipe

Passed

N/A

0.081378s

lib/libc/sys/t_poll

23.153536s

poll_3way

Passed

N/A

20.444828s

poll_basic

Passed

N/A

0.128145s

poll_err

Passed

N/A

0.076624s

pollts_basic

Passed

N/A

2.258708s

pollts_err

Passed

N/A

0.079916s

pollts_sigmask

Passed

N/A

0.082863s

lib/libc/sys/t_posix_fallocate

0.170316s

ebadf

Passed

N/A

0.113347s

lib/libc/sys/t_recvmmsg

0.134008s

recvmmsg_basic

Passed

N/A

0.121857s

lib/libc/sys/t_revoke

0.746343s

revoke_basic

Passed

N/A

0.357398s

revoke_err

Passed

N/A

0.125282s

revoke_perm

Passed

N/A

0.200636s

lib/libc/sys/t_select

2.591284s

pselect_sigmask

Passed

N/A

2.420773s

pselect_timeout

Passed

N/A

0.096652s

lib/libc/sys/t_setrlimit

1.565632s

setrlimit_basic

Passed

N/A

0.093939s

setrlimit_current

Passed

N/A

0.093384s

setrlimit_err

Passed

N/A

0.212363s

setrlimit_fsize

Passed

N/A

0.240966s

setrlimit_memlock

Passed

N/A

0.100200s

setrlimit_nofile_1

Passed

N/A

0.104605s

setrlimit_nofile_2

Passed

N/A

0.105553s

setrlimit_nproc

Passed

N/A

0.108533s

setrlimit_nthr

Passed

N/A

0.197194s

setrlimit_perm

Passed

N/A

0.142725s

lib/libc/sys/t_setuid

0.617533s

setuid_perm

Passed

N/A

0.093331s

setuid_real

Passed

N/A

0.085539s

setuid_root

Passed

N/A

0.370217s

lib/libc/sys/t_sigaction

0.300764s

sigaction_basic

Passed

N/A

0.095801s

sigaction_noflags

Passed

N/A

0.086377s

sigaction_resethand

Passed

N/A

0.088867s

lib/libc/sys/t_sigqueue

0.297415s

sigqueue_basic

Passed

N/A

0.079109s

sigqueue_err

Passed

N/A

0.183074s

lib/libc/sys/t_sigtimedwait

21.015682s

sigtimedwait_NULL_timeout

Passed

N/A

10.674722s

sigtimedwait_all0timeout

Passed

N/A

0.077952s

sigtimedwait_small_timeout

Passed

N/A

10.234496s

lib/libc/sys/t_socketpair

0.407879s

socketpair_basic

Passed

N/A

0.181445s

socketpair_cloexec

Passed

N/A

0.077295s

socketpair_nonblock

Passed

N/A

0.078948s

lib/libc/sys/t_swapcontext

0.288936s

swapcontext1

Passed

N/A

0.087684s

swapcontext2

Passed

N/A

0.173050s

lib/libc/sys/t_stat

9.700996s

stat_chflags

Passed

N/A

0.101856s

stat_dir

Passed

N/A

2.166111s

stat_err

Passed

N/A

0.180619s

stat_mtime

Passed

N/A

6.361403s

stat_perm

Passed

N/A

0.155131s

stat_size

Passed

N/A

0.160027s

stat_socket

Passed

N/A

0.216264s

stat_symlink

Passed

N/A

0.216370s

lib/libc/sys/t_timer_create

13.084754s

timer_create_err

Passed

N/A

0.085750s

timer_create_mono

Passed

N/A

2.223462s

timer_create_mono_expire

Passed

N/A

4.377517s

timer_create_real

Passed

N/A

2.136548s

timer_create_real_expire

Passed

N/A

4.187801s

lib/libc/sys/t_truncate

0.756098s

ftruncate_basic

Passed

N/A

0.310484s

ftruncate_err

Passed

N/A

0.115697s

truncate_basic

Passed

N/A

0.175106s

truncate_err

Passed

N/A

0.094362s

lib/libc/sys/t_ucontext

0.242891s

ucontext_basic

Passed

N/A

0.188883s

lib/libc/sys/t_umask

0.719230s

umask_fork

Passed

N/A

0.201669s

umask_open

Passed

N/A

0.169739s

umask_previous

Passed

N/A

0.289372s

lib/libc/sys/t_unlink

1.506695s

unlink_basic

Passed

N/A

0.801646s

unlink_err

Passed

N/A

0.218889s

unlink_fifo

Passed

N/A

0.219615s

unlink_perm

Passed

N/A

0.169433s

lib/libc/sys/t_wait

0.826733s

wait6_coredumped

Passed

N/A

0.255566s

wait6_exited

Passed

N/A

0.147863s

wait6_invalid

Passed

N/A

0.077074s

wait6_noproc

Passed

N/A

0.080813s

wait6_stop_and_go

Passed

N/A

0.094803s

wait6_terminated

Passed

N/A

0.088734s

lib/libc/sys/t_write

1.010673s

write_err

Passed

N/A

0.247045s

write_pipe

Passed

N/A

0.079552s

write_pos

Passed

N/A

0.163133s

write_ret

Passed

N/A

0.320160s

writev_iovmax

Passed

N/A

0.101647s

lib/libc/sys/t_posix_fadvise

0.771962s

posix_fadvise

Passed

N/A

0.103406s

posix_fadvise_reg

Passed

N/A

0.603614s

lib/libc/termios/t_tcsetpgrp

0.258914s

tcsetpgrp_err

Passed

N/A

0.197787s

lib/libc/time/t_mktime

0.303044s

localtime_r_gmt

Passed

N/A

0.102809s

mktime_negyear

Passed

N/A

0.083971s

timegm_epoch

Passed

N/A

0.084804s

lib/libc/time/t_strptime

1.873104s

Zone

Passed

N/A

0.258408s

common

Passed

N/A

0.083733s

day

Passed

N/A

0.083425s

hour

Passed

N/A

0.086200s

month

Passed

N/A

0.083746s

seconds

Passed

N/A

0.195452s

year

Passed

N/A

0.657325s

zone

Passed

N/A

0.238750s

lib/libc/tls/t_tls_static

0.009150s

lib/libc/tls/t_tls_dynamic

0.003367s

lib/libc/tls/t_tls_dlopen

0.003148s

lib/libc/ttyio/t_ptm

0.257942s

ptm

Passed

N/A

0.147611s

ptmx

Passed

N/A

0.059415s

lib/libc/ttyio/t_ttyio

4.400357s

ioctl

Passed

N/A

4.159494s

lib/libc/ssp/t_ssp

30.895845s

fgets

Passed

N/A

1.756761s

getcwd

Passed

N/A

1.649954s

gets

Passed

N/A

1.536560s

memcpy

Passed

N/A

1.572872s

memmove

Passed

N/A

1.619145s

memset

Passed

N/A

1.524826s

raw

Passed

N/A

1.291987s

read

Passed

N/A

1.701103s

readlink

Passed

N/A

1.574602s

snprintf

Passed

N/A

1.541096s

sprintf

Passed

N/A

1.591769s

stpcpy

Passed

N/A

1.660345s

stpncpy

Passed

N/A

1.410172s

strcat

Passed

N/A

1.593841s

strcpy

Passed

N/A

1.692499s

strncat

Passed

N/A

1.539673s

strncpy

Passed

N/A

1.525547s

vsnprintf

Passed

N/A

1.692493s

vsprintf

Passed

N/A

1.513641s

lib/libc/t_convfp

0.408778s

cast_ulong

Passed

N/A

0.113943s

cast_ulong2

Passed

N/A

0.081358s

conv_uint

Passed

N/A

0.081308s

conv_ulong

Passed

N/A

0.089067s

lib/libc/t_gdtoa

0.337100s

long_format

Passed

N/A

0.271978s

lib/libc/t_cdb

0.645320s

cdb

Passed

N/A

0.581795s

lib/libcrypt/t_crypt

0.168750s

crypt_salts

Passed

N/A

0.152100s

lib/libcurses/t_curses

56.197547s

addch

Passed

N/A

1.155913s

addchnstr

Passed

N/A

1.422576s

addchstr

Passed

N/A

1.486976s

addnstr

Passed

N/A

1.385095s

addstr

Passed

N/A

2.413799s

assume_default_colors

Passed

N/A

1.817835s

attributes

Passed

N/A

1.998670s

background

Passed

N/A

1.949341s

box

Passed

N/A

1.671339s

can_change_color

Passed

N/A

1.210048s

cbreak

Passed

N/A

2.073766s

clear

Passed

N/A

6.340368s

copywin

Passed

N/A

4.040071s

curs_set

Passed

N/A

1.456890s

getch

Passed

N/A

1.426527s

getstr

Passed

N/A

1.725389s

mvwin

Passed

N/A

1.676055s

startup

Passed

N/A

1.319144s

termattrs

Passed

N/A

1.266875s

timeout

Passed

N/A

10.421247s

wborder

Passed

N/A

1.659603s

window

Passed

N/A

1.527976s

wprintw

Passed

N/A

1.415622s

wscrl

Passed

N/A

1.873841s

lib/libevent/t_event

856.047674s

kqueue

Failed

check report

285.354504s

poll

Failed

check report

288.546644s

select

Failed

check report

281.867545s

lib/libexecinfo/t_backtrace

0.202600s

backtrace_fmt_basic

Passed

N/A

0.186310s

lib/libm/t_acos

0.522843s

acos_inrange

Passed

N/A

0.219741s

acos_is_nan

Passed

N/A

0.148540s

acos_is_plus_zero

Passed

N/A

0.079133s

lib/libm/t_asin

2.225518s

asin_inf_neg

Passed

N/A

0.208810s

asin_inf_pos

Passed

N/A

0.085767s

asin_inrange

Passed

N/A

0.085633s

asin_nan

Passed

N/A

0.207208s

asin_range

Passed

N/A

0.156938s

asin_zero_neg

Passed

N/A

0.084897s

asin_zero_pos

Passed

N/A

0.085115s

asinf_inf_neg

Passed

N/A

0.213662s

asinf_inf_pos

Passed

N/A

0.160502s

asinf_inrange

Passed

N/A

0.090562s

asinf_nan

Passed

N/A

0.085191s

asinf_range

Passed

N/A

0.209634s

asinf_zero_neg

Passed

N/A

0.156877s

asinf_zero_pos

Passed

N/A

0.083842s

lib/libm/t_atan

0.612829s

atan_inrange

Passed

N/A

0.281516s

atan_nan

Passed

N/A

0.085873s

atan_zero_neg

Passed

N/A

0.081364s

atan_zero_pos

Passed

N/A

0.081813s

lib/libm/t_cbrt

2.161499s

cbrt_inf_neg

Passed

N/A

0.166497s

cbrt_inf_pos

Passed

N/A

0.089521s

cbrt_nan

Passed

N/A

0.229659s

cbrt_pow

Passed

N/A

0.159494s

cbrt_zero_neg

Passed

N/A

0.085012s

cbrt_zero_pos

Passed

N/A

0.056527s

cbrtf_inf_neg

Passed

N/A

0.132170s

cbrtf_inf_pos

Passed

N/A

0.098090s

cbrtf_nan

Passed

N/A

0.055556s

cbrtf_powf

Passed

N/A

0.061626s

cbrtf_zero_neg

Passed

N/A

0.133656s

cbrtf_zero_pos

Passed

N/A

0.097779s

cbrtl_inf_neg

Passed

N/A

0.057728s

cbrtl_inf_pos

Passed

N/A

0.056916s

cbrtl_nan

Passed

N/A

0.130907s

cbrtl_powl

Passed

N/A

0.108742s

cbrtl_zero_neg

Passed

N/A

0.061983s

cbrtl_zero_pos

Passed

N/A

0.061474s

lib/libm/t_ceil

6.276362s

ceil_basic

Passed

N/A

0.120848s

ceil_inf_neg

Passed

N/A

0.072493s

ceil_inf_pos

Passed

N/A

0.152986s

ceil_nan

Passed

N/A

0.106287s

ceil_zero_neg

Passed

N/A

0.068307s

ceil_zero_pos

Passed

N/A

0.069769s

ceilf_basic

Passed

N/A

0.159482s

ceilf_inf_neg

Passed

N/A

0.109904s

ceilf_inf_pos

Passed

N/A

0.074174s

ceilf_nan

Passed

N/A

0.140672s

ceilf_zero_neg

Passed

N/A

0.115888s

ceilf_zero_pos

Passed

N/A

0.071208s

ceill_basic

Passed

N/A

0.068207s

ceill_inf_neg

Passed

N/A

0.145202s

ceill_inf_pos

Passed

N/A

0.113823s

ceill_nan

Passed

N/A

0.069031s

ceill_zero_neg

Passed

N/A

0.068196s

ceill_zero_pos

Passed

N/A

0.153648s

floor_basic

Passed

N/A

0.100806s

floor_inf_neg

Passed

N/A

0.069594s

floor_inf_pos

Passed

N/A

0.135904s

floor_nan

Passed

N/A

0.114949s

floor_zero_neg

Passed

N/A

0.066902s

floor_zero_pos

Passed

N/A

0.071887s

floorf_basic

Passed

N/A

0.150910s

floorf_inf_neg

Passed

N/A

0.114306s

floorf_inf_pos

Passed

N/A

0.070492s

floorf_nan

Passed

N/A

0.070527s

floorf_zero_neg

Passed

N/A

0.152206s

floorf_zero_pos

Passed

N/A

0.108981s

floorl_basic

Passed

N/A

0.067861s

floorl_inf_neg

Passed

N/A

0.069500s

floorl_inf_pos

Passed

N/A

0.160814s

floorl_nan

Passed

N/A

0.106086s

floorl_zero_neg

Passed

N/A

0.072003s

floorl_zero_pos

Passed

N/A

0.146160s

trunc_basic

Passed

N/A

0.120711s

trunc_inf_neg

Passed

N/A

0.067914s

trunc_inf_pos

Passed

N/A

0.069085s

trunc_nan

Passed

N/A

0.145841s

trunc_zero_neg

Passed

N/A

0.110050s

trunc_zero_pos

Passed

N/A

0.066103s

truncf_basic

Passed

N/A

0.108592s

truncf_inf_neg

Passed

N/A

0.139293s

truncf_inf_pos

Passed

N/A

0.068669s

truncf_nan

Passed

N/A

0.072797s

truncf_zero_neg

Passed

N/A

0.141281s

truncf_zero_pos

Passed

N/A

0.114507s

truncl_basic

Passed

N/A

0.066332s

truncl_inf_neg

Passed

N/A

0.067181s

truncl_inf_pos

Passed

N/A

0.151361s

truncl_nan

Passed

N/A

0.107952s

truncl_zero_neg

Passed

N/A

0.065507s

truncl_zero_pos

Passed

N/A

0.068052s

lib/libm/t_cos

1.320579s

cos_angles

Passed

N/A

0.104635s

cos_inf_neg

Passed

N/A

0.062245s

cos_inf_pos

Passed

N/A

0.142381s

cos_nan

Passed

N/A

0.103749s

cos_zero_neg

Passed

N/A

0.057184s

cos_zero_pos

Passed

N/A

0.057719s

cosf_angles

Passed

N/A

0.129173s

cosf_inf_neg

Expected failure

PR lib/45362: cosf(-Inf) != NaN

0.109486s

cosf_inf_pos

Expected failure

PR lib/45362: cosf(+Inf) != NaN

0.060183s

cosf_nan

Passed

N/A

0.058044s

cosf_zero_neg

Passed

N/A

0.134216s

cosf_zero_pos

Passed

N/A

0.102969s

lib/libm/t_cosh

1.251835s

cosh_inf_neg

Passed

N/A

0.116853s

cosh_inf_pos

Passed

N/A

0.124266s

cosh_inrange

Passed

N/A

0.060910s

cosh_nan

Passed

N/A

0.058465s

cosh_zero_neg

Passed

N/A

0.060705s

cosh_zero_pos

Passed

N/A

0.152199s

coshf_inf_neg

Passed

N/A

0.096341s

coshf_inf_pos

Passed

N/A

0.057921s

coshf_inrange

Passed

N/A

0.059404s

coshf_nan

Passed

N/A

0.142277s

coshf_zero_neg

Passed

N/A

0.094422s

coshf_zero_pos

Passed

N/A

0.058878s

lib/libm/t_erf

1.727696s

erf_inf_neg

Passed

N/A

0.131787s

erf_inf_pos

Passed

N/A

0.060382s

erf_nan

Passed

N/A

0.058674s

erf_zero_neg

Passed

N/A

0.139198s

erf_zero_pos

Passed

N/A

0.100976s

erfc_inf_neg

Passed

N/A

0.059136s

erfc_inf_pos

Passed

N/A

0.058254s

erfc_nan

Passed

N/A

0.133788s

erfcf_inf_neg

Passed

N/A

0.105634s

erfcf_inf_pos

Passed

N/A

0.060741s

erfcf_nan

Passed

N/A

0.059692s

erff_inf_neg

Passed

N/A

0.136886s

erff_inf_pos

Passed

N/A

0.103744s

erff_nan

Passed

N/A

0.063016s

erff_zero_neg

Passed

N/A

0.065637s

erff_zero_pos

Passed

N/A

0.137998s

lib/libm/t_exp

2.889624s

exp2_is_nan

Passed

N/A

0.079037s

exp2_is_plus_zero

Passed

N/A

0.139964s

exp2_powers

Passed

N/A

0.113069s

exp2_values

Passed

N/A

0.065334s

exp_inf_neg

Passed

N/A

0.062581s

exp_inf_pos

Passed

N/A

0.140166s

exp_nan

Passed

N/A

0.107832s

exp_product

Passed

N/A

0.063738s

exp_zero_neg

Passed

N/A

0.062468s

exp_zero_pos

Passed

N/A

0.139521s

expf_inf_neg

Passed

N/A

0.113324s

expf_inf_pos

Passed

N/A

0.064986s

expf_nan

Passed

N/A

0.064031s

expf_product

Passed

N/A

0.140325s

expf_zero_neg

Passed

N/A

0.112063s

expf_zero_pos

Passed

N/A

0.062708s

expm1_inf_neg

Passed

N/A

0.061799s

expm1_inf_pos

Passed

N/A

0.138638s

expm1_nan

Passed

N/A

0.113084s

expm1_zero_neg

Passed

N/A

0.062114s

expm1_zero_pos

Passed

N/A

0.064551s

expm1f_inf_neg

Passed

N/A

0.135660s

expm1f_inf_pos

Passed

N/A

0.113772s

expm1f_nan

Passed

N/A

0.064193s

expm1f_zero_neg

Passed

N/A

0.064162s

expm1f_zero_pos

Passed

N/A

0.137534s

lib/libm/t_fenv

0.433672s

feenableexcept

Passed

N/A

0.070210s

fegetexcept

Passed

N/A

0.140023s

fegetround

Passed

N/A

0.103067s

fesetround

Passed

N/A

0.059672s

lib/libm/t_fmod

0.228301s

fmod

Expected failure

PR misc/44767: 1 checks failed as expected; see output for more details

0.189867s

lib/libm/t_hypot

0.349907s

hypot_integer

Passed

N/A

0.057062s

hypotf_integer

Passed

N/A

0.143024s

pr50698

Passed

N/A

0.091738s

lib/libm/t_infinity

0.341200s

infinity_double

Passed

N/A

0.131331s

infinity_float

Passed

N/A

0.100916s

infinity_long_double

Passed

N/A

0.056011s

lib/libm/t_ldexp

1.992924s

ldexp_basic

Passed

N/A

0.139808s

ldexp_denormal

Passed

N/A

0.062434s

ldexp_denormal_large

Passed

N/A

0.073359s

ldexp_exp2

Passed

N/A

0.146175s

ldexp_inf_neg

Passed

N/A

0.093135s

ldexp_inf_pos

Passed

N/A

0.061716s

ldexp_infinity

Passed

N/A

0.061786s

ldexp_nan

Passed

N/A

0.141208s

ldexp_overflow

Passed

N/A

0.104230s

ldexp_underflow

Passed

N/A

0.060105s

ldexp_zero

Passed

N/A

0.059947s

ldexp_zero_neg

Passed

N/A

0.137843s

ldexp_zero_pos

Passed

N/A

0.098465s

ldexpf_exp2f

Passed

N/A

0.058766s

ldexpf_inf_neg

Passed

N/A

0.061176s

ldexpf_inf_pos

Passed

N/A

0.140152s

ldexpf_nan

Passed

N/A

0.104897s

ldexpf_zero_neg

Passed

N/A

0.060309s

ldexpf_zero_pos

Passed

N/A

0.058988s

lib/libm/t_log

6.606684s

log10_base

Passed

N/A

0.123519s

log10_inf_neg

Passed

N/A

0.078939s

log10_inf_pos

Passed

N/A

0.157585s

log10_nan

Passed

N/A

0.108740s

log10_one_pos

Passed

N/A

0.071717s

log10_zero_neg

Passed

N/A

0.148915s

log10_zero_pos

Passed

N/A

0.124201s

log10f_base

Passed

N/A

0.071697s

log10f_inf_neg

Passed

N/A

0.074695s

log10f_inf_pos

Passed

N/A

0.153020s

log10f_nan

Passed

N/A

0.112976s

log10f_one_pos

Passed

N/A

0.071014s

log10f_zero_neg

Passed

N/A

0.117391s

log10f_zero_pos

Passed

N/A

0.149472s

log1p_inf_neg

Expected failure

PR lib/45362: log1p(-Inf) != NaN

0.071345s

log1p_inf_pos

Passed

N/A

0.070612s

log1p_nan

Passed

N/A

0.142442s

log1p_one_neg

Expected failure

PR lib/45362: log1p(-1.0) != -HUGE_VAL

0.119295s

log1p_zero_neg

Passed

N/A

0.069726s

log1p_zero_pos

Passed

N/A

0.071351s

log1pf_inf_neg

Expected failure

PR lib/45362: log1pf(-Inf) != NaN

0.155377s

log1pf_inf_pos

Passed

N/A

0.106432s

log1pf_nan

Passed

N/A

0.068561s

log1pf_one_neg

Expected failure

PR lib/45362: log1pf(-1.0) != -HUGE_VALF

0.145033s

log1pf_zero_neg

Passed

N/A

0.117346s

log1pf_zero_pos

Passed

N/A

0.067909s

log2_base

Passed

N/A

0.068826s

log2_inf_neg

Passed

N/A

0.151146s

log2_inf_pos

Passed

N/A

0.111314s

log2_nan

Passed

N/A

0.073870s

log2_one_pos

Passed

N/A

0.078140s

log2_zero_neg

Passed

N/A

0.208407s

log2_zero_pos

Passed

N/A

0.075735s

log2f_base

Passed

N/A

0.070799s

log2f_inf_neg

Passed

N/A

0.149131s

log2f_inf_pos

Passed

N/A

0.125219s

log2f_nan

Passed

N/A

0.071916s

log2f_one_pos

Passed

N/A

0.071992s

log2f_zero_neg

Passed

N/A

0.153008s

log2f_zero_pos

Passed

N/A

0.118697s

log_base

Passed

N/A

0.071791s

log_inf_neg

Passed

N/A

0.142724s

log_inf_pos

Passed

N/A

0.122473s

log_nan

Passed

N/A

0.068475s

log_one_pos

Passed

N/A

0.068703s

log_zero_neg

Passed

N/A

0.145294s

log_zero_pos

Passed

N/A

0.120292s

logf_base

Passed

N/A

0.069034s

logf_inf_neg

Passed

N/A

0.069290s

logf_inf_pos

Passed

N/A

0.151603s

logf_nan

Passed

N/A

0.109338s

logf_one_pos

Passed

N/A

0.067439s

logf_zero_neg

Passed

N/A

0.144980s

logf_zero_pos

Passed

N/A

0.113211s

lib/libm/t_modf

0.174489s

modf

Passed

N/A

0.127245s

lib/libm/t_pow

2.180594s

pow_inf_neg_x

Passed

N/A

0.076164s

pow_inf_neg_y

Passed

N/A

0.135517s

pow_inf_pos_x

Passed

N/A

0.111062s

pow_inf_pos_y

Passed

N/A

0.062160s

pow_nan_x

Passed

N/A

0.067385s

pow_nan_y

Passed

N/A

0.137220s

pow_one_neg_x

Expected failure

PR lib/45372: 2 checks failed as expected; see output for more details

0.119898s

pow_one_pos_x

Passed

N/A

0.060807s

pow_zero_x

Failed

1 checks failed; see output for more details

0.063004s

pow_zero_y

Passed

N/A

0.140869s

powf_inf_neg_x

Passed

N/A

0.103867s

powf_inf_neg_y

Passed

N/A

0.063711s

powf_inf_pos_x

Passed

N/A

0.060959s

powf_inf_pos_y

Passed

N/A

0.145214s

powf_nan_x

Passed

N/A

0.104134s

powf_nan_y

Passed

N/A

0.059360s

powf_one_neg_x

Expected failure

PR lib/45372: 2 checks failed as expected; see output for more details

0.067986s

powf_one_pos_x

Passed

N/A

0.139511s

powf_zero_x

Failed

1 checks failed; see output for more details

0.104519s

powf_zero_y

Passed

N/A

0.057963s

lib/libm/t_precision

0.165817s

t_precision

Passed

N/A

0.129711s

lib/libm/t_round

0.063517s

round_dir

Passed

N/A

0.056149s

lib/libm/t_scalbn

2.222915s

scalbn_inf_neg

Passed

N/A

0.103929s

scalbn_inf_pos

Passed

N/A

0.066586s

scalbn_ldexp

Passed

N/A

0.139322s

scalbn_nan

Passed

N/A

0.108500s

scalbn_val

Passed

N/A

0.063578s

scalbn_zero_neg

Passed

N/A

0.060382s

scalbn_zero_pos

Passed

N/A

0.146824s

scalbnf_inf_neg

Passed

N/A

0.107406s

scalbnf_inf_pos

Passed

N/A

0.061997s

scalbnf_ldexpf

Passed

N/A

0.063437s

scalbnf_nan

Passed

N/A

0.145059s

scalbnf_val

Passed

N/A

0.104931s

scalbnf_zero_neg

Passed

N/A

0.061208s

scalbnf_zero_pos

Passed

N/A

0.063452s

scalbnl_inf_neg

Passed

N/A

0.136974s

scalbnl_inf_pos

Passed

N/A

0.109639s

scalbnl_nan

Passed

N/A

0.061382s

scalbnl_val

Passed

N/A

0.058991s

scalbnl_zero_neg

Passed

N/A

0.133137s

scalbnl_zero_pos

Passed

N/A

0.110453s

lib/libm/t_sin

1.215420s

sin_angles

Passed

N/A

0.121828s

sin_inf_neg

Passed

N/A

0.110749s

sin_inf_pos

Passed

N/A

0.058338s

sin_nan

Passed

N/A

0.057910s

sin_zero_neg

Passed

N/A

0.130827s

sin_zero_pos

Passed

N/A

0.102613s

sinf_angles

Passed

N/A

0.054525s

sinf_inf_neg

Expected failure

PR lib/45362: sinf(-Inf) != NaN

0.057521s

sinf_inf_pos

Expected failure

PR lib/45362: sinf(+Inf) != NaN

0.058249s

sinf_nan

Passed

N/A

0.139766s

sinf_zero_neg

Passed

N/A

0.092490s

sinf_zero_pos

Passed

N/A

0.058361s

lib/libm/t_sinh

1.325644s

sinh_inf_neg

Passed

N/A

0.136861s

sinh_inf_pos

Passed

N/A

0.064393s

sinh_inrange

Passed

N/A

0.059681s

sinh_nan

Passed

N/A

0.134686s

sinh_zero_neg

Passed

N/A

0.103928s

sinh_zero_pos

Passed

N/A

0.060503s

sinhf_inf_neg

Passed

N/A

0.060350s

sinhf_inf_pos

Passed

N/A

0.133233s

sinhf_inrange

Passed

N/A

0.111409s

sinhf_nan

Passed

N/A

0.059552s

sinhf_zero_neg

Passed

N/A

0.058108s

sinhf_zero_pos

Passed

N/A

0.138554s

lib/libm/t_sqrt

1.969392s

sqrt_inf_neg

Passed

N/A

0.085505s

sqrt_inf_pos

Passed

N/A

0.151392s

sqrt_nan

Passed

N/A

0.106874s

sqrt_pow

Passed

N/A

0.059362s

sqrt_zero_neg

Passed

N/A

0.058861s

sqrt_zero_pos

Passed

N/A

0.131503s

sqrtf_inf_neg

Passed

N/A

0.109404s

sqrtf_inf_pos

Passed

N/A

0.059470s

sqrtf_nan

Passed

N/A

0.060037s

sqrtf_powf

Passed

N/A

0.130999s

sqrtf_zero_neg

Passed

N/A

0.107078s

sqrtf_zero_pos

Passed

N/A

0.061336s

sqrtl_inf_neg

Passed

N/A

0.061936s

sqrtl_inf_pos

Passed

N/A

0.133362s

sqrtl_nan

Passed

N/A

0.111253s

sqrtl_powl

Passed

N/A

0.062045s

sqrtl_zero_neg

Passed

N/A

0.062736s

sqrtl_zero_pos

Passed

N/A

0.136563s

lib/libm/t_tan

1.268427s

tan_angles

Passed

N/A

0.076919s

tan_inf_neg

Passed

N/A

0.137434s

tan_inf_pos

Passed

N/A

0.107746s

tan_nan

Passed

N/A

0.057351s

tan_zero_neg

Passed

N/A

0.058366s

tan_zero_pos

Passed

N/A

0.103094s

tanf_angles

Passed

N/A

0.137619s

tanf_inf_neg

Expected failure

PR lib/45362: tanf(-Inf) != NaN

0.061696s

tanf_inf_pos

Expected failure

PR lib/45362: tanf(+Inf) != NaN

0.060765s

tanf_nan

Passed

N/A

0.058023s

tanf_zero_neg

Passed

N/A

0.137869s

tanf_zero_pos

Passed

N/A

0.095814s

lib/libm/t_tanh

1.125974s

tanh_inf_neg

Passed

N/A

0.136492s

tanh_inf_pos

Passed

N/A

0.102380s

tanh_nan

Passed

N/A

0.057373s

tanh_zero_neg

Passed

N/A

0.058832s

tanh_zero_pos

Passed

N/A

0.134572s

tanhf_inf_neg

Passed

N/A

0.109366s

tanhf_inf_pos

Passed

N/A

0.057986s

tanhf_nan

Passed

N/A

0.059428s

tanhf_zero_neg

Passed

N/A

0.132399s

tanhf_zero_pos

Passed

N/A

0.108929s

lib/libobjc/t_threads

604.939061s

thread_callback

Failed

Test case timed out after 300 seconds

604.819076s

lib/libposix/bsd/t_rename

0.140121s

rename

Passed

N/A

0.119874s

lib/libposix/posix1/t_rename

0.099618s

rename

Passed

N/A

0.085894s

lib/libposix/posix2/t_rename

0.238338s

rename

Passed

N/A

0.186004s

lib/libppath/t_ppath

3.427451s

component_at

Passed

N/A

0.114981s

copydel_bool_success

Passed

N/A

0.117313s

copydel_object_twice_success

Passed

N/A

0.233688s

copyset_bool_success

Passed

N/A

0.178822s

copyset_object_twice_success

Passed

N/A

0.112726s

create_bool_eexist

Passed

N/A

0.107980s

create_bool_success

Passed

N/A

0.108428s

delete_bool_eftype

Passed

N/A

0.172726s

delete_bool_enoent

Passed

N/A

0.195620s

delete_bool_success

Passed

N/A

0.103227s

get_bool_eftype

Passed

N/A

0.103971s

get_bool_enoent

Passed

N/A

0.105587s

get_bool_success

Passed

N/A

0.098907s

get_idx_key

Passed

N/A

0.163949s

get_string_eftype

Passed

N/A

0.101410s

get_string_enoent

Passed

N/A

0.061820s

get_string_success

Passed

N/A

0.062006s

length

Passed

N/A

0.085472s

pop_until_empty

Passed

N/A

0.096173s

ppath_copy

Passed

N/A

0.200238s

push_until_full

Passed

N/A

0.163676s

replace

Passed

N/A

0.073240s

set_bool_eftype

Passed

N/A

0.097891s

set_bool_enoent

Passed

N/A

0.105362s

set_bool_success

Passed

N/A

0.104332s

lib/libprop/t_basic

0.288476s

prop_basic

Passed

N/A

0.131349s

prop_dictionary_equals

Passed

N/A

0.092202s

lib/libpthread/t_barrier

20.525622s

barrier

Passed

N/A

20.490347s

lib/libpthread/t_cond

28.048242s

bogus_timedwaits

Passed

N/A

0.118318s

broadcast

Passed

N/A

2.472942s

cond_timedwait_race

Passed

N/A

10.868664s

destroy_after_cancel

Passed

N/A

0.088409s

signal_before_unlock

Passed

N/A

4.089614s

signal_before_unlock_static_init

Passed

N/A

4.087149s

signal_delay_wait

Passed

N/A

4.165898s

signal_wait_race

Passed

N/A

2.053116s

lib/libpthread/t_condwait

8.253946s

cond_wait_mono

Passed

N/A

4.137056s

cond_wait_real

Passed

N/A

4.097068s

lib/libpthread/t_detach

0.127562s

pthread_detach

Passed

N/A

0.093947s

lib/libpthread/t_equal

0.060464s

pthread_equal

Passed

N/A

0.054186s

lib/libpthread/t_fork

10.173135s

fork

Passed

N/A

10.145846s

lib/libpthread/t_fpu

0.095312s

fpu

Passed

N/A

0.084748s

lib/libpthread/t_join

0.224137s

pthread_join

Passed

N/A

0.171764s

lib/libpthread/t_kill

0.148181s

simple

Passed

N/A

0.134852s

lib/libpthread/t_mutex

33.293093s

mutex1

Passed

N/A

8.235976s

mutex2

Passed

N/A

6.957820s

mutex3

Passed

N/A

9.919118s

mutex4

Passed

N/A

8.136036s

lib/libpthread/t_name

0.245567s

name

Passed

N/A

0.187378s

lib/libpthread/t_once

0.519324s

once1

Passed

N/A

0.098723s

once2

Passed

N/A

0.156650s

once3

Passed

N/A

0.222961s

lib/libpthread/t_preempt

2.118107s

preempt1

Passed

N/A

2.106868s

lib/libpthread/t_rwlock

2.277068s

rwlock1

Passed

N/A

2.148510s

rwlock_static

Passed

N/A

0.092029s

lib/libpthread/t_sem

41.913427s

before_start_no_threads

Passed

N/A

20.482944s

before_start_one_thread

Passed

N/A

20.341969s

named

Passed

N/A

0.137785s

unnamed

Passed

N/A

0.905835s

lib/libpthread/t_sigmask

8.753004s

before_threads

Passed

N/A

0.069547s

incorrect_mask_bug

Passed

N/A

6.273673s

respected_while_running

Passed

N/A

2.268544s

upcalls_not_started

Passed

N/A

0.080593s

lib/libpthread/t_sigsuspend

2.115643s

sigsuspend

Passed

N/A

2.103209s

lib/libpthread/t_siglongjmp

0.130239s

siglongjmp1

Passed

N/A

0.095928s

lib/libpthread/t_sleep

2.085712s

sleep1

Passed

N/A

2.076823s

lib/libpthread/t_swapcontext

0.270556s

swapcontext1

Passed

N/A

0.227368s

lib/libpthread/t_atexit

1.419308s

atexit

Passed

N/A

1.366794s

lib/libpthread/t_cancel

1.320601s

register_while_disabled

Passed

N/A

1.259916s

lib/libpthread/t_exit

1.269242s

main_thread

Passed

N/A

1.208938s

lib/libpthread/t_resolv

36.639938s

resolv

Passed

N/A

36.560764s

lib/librt/t_sched

0.991303s

sched_getparam

Passed

N/A

0.071190s

sched_priority

Passed

N/A

0.081237s

sched_rr_get_interval_1

Passed

N/A

0.090472s

sched_rr_get_interval_2

Passed

N/A

0.199410s

sched_setscheduler_1

Passed

N/A

0.165088s

sched_setscheduler_2

Passed

N/A

0.092330s

sched_setscheduler_3

Passed

N/A

0.095490s

sched_setscheduler_4

Passed

N/A

0.093194s

lib/librt/t_sem

41.340532s

basic

Passed

N/A

0.202705s

child

Passed

N/A

41.071264s

lib/libtre/t_regex_att

1.653170s

basic

Passed

N/A

0.302642s

categorization

Passed

N/A

0.273950s

forcedassoc

Passed

N/A

0.174096s

leftassoc

Passed

N/A

0.106395s

nullsubexpr

Passed

N/A

0.148729s

repetition

Passed

N/A

0.372959s

rightassoc

Expected failure

Reason for breakage unknown: /tmp/bracket/build/2016.06.15.04.33.52-i386/src/tests/lib/libtre/../libc/regex/t_regex_att.c:377: res != matches ((0,4)(0,1)(1,4)(4,4) != (0,4)(0,2)(2,3)(3,4)): at line 3

0.162326s

lib/libtre/t_exhaust

0.021484s

regcomp_too_big

Skipped

Not enough memory; needed 125829120, available 41521152

0.010191s

lib/libusbhid/t_usbhid

0.858932s

check_hid_get_data

Failed

4 checks failed; see output for more details

0.217575s

check_hid_logical_range

Expected failure

only the 32-bit opcode works, 8 and 16-bit is broken: 4 checks failed as expected; see output for more details

0.166469s

check_hid_physical_range

Expected failure

only the 32-bit opcode works, 8 and 16-bit is broken: 4 checks failed as expected; see output for more details

0.110222s

check_hid_set_data

Passed

N/A

0.100030s

check_hid_usage

Passed

N/A

0.100479s

check_parse_just_pop

Passed

N/A

0.080209s

lib/libutil/t_efun

0.418615s

ecalloc

Passed

N/A

0.117053s

efopen

Passed

N/A

0.075886s

emalloc

Passed

N/A

0.077226s

erealloc

Passed

N/A

0.077329s

lib/libutil/t_parsedate

16.232201s

atsecs

Passed

N/A

0.242734s

dates

Passed

N/A

0.163621s

dsttimes

Passed

N/A

0.110097s

gibberish

Passed

N/A

0.094405s

relative

Passed

N/A

15.112165s

times

Passed

N/A

0.220873s

zones

Passed

N/A

0.158182s

lib/libutil/t_pidfile

0.953029s

change_basenames

Passed

N/A

0.130602s

change_mix

Passed

N/A

0.126864s

change_paths

Passed

N/A

0.274683s

custom_basename

Passed

N/A

0.135298s

custom_path

Passed

N/A

0.110426s

default_path

Passed

N/A

0.103117s

lib/libutil/t_snprintb

0.371838s

snprintb

Passed

N/A

0.181183s

snprintb_m

Passed

N/A

0.132759s

lib/libutil/t_sockaddr_snprintf

0.622320s

sockaddr_snprintf_at

Passed

N/A

0.080347s

sockaddr_snprintf_dl

Passed

N/A

0.078731s

sockaddr_snprintf_in

Passed

N/A

0.076989s

sockaddr_snprintf_in6

Passed

N/A

0.178793s

sockaddr_snprintf_un

Passed

N/A

0.129123s

lib/semaphore/pthread/t_sem_pth

3.633546s

blocktimedwait

Passed

N/A

0.959716s

blockwait

Passed

N/A

0.790022s

busydestroy

Passed

N/A

0.472444s

destroy

Passed

N/A

0.301587s

initvalue

Passed

N/A

0.217860s

named

Passed

N/A

0.267863s

postwait

Passed

N/A

0.211981s

unlink

Passed

N/A

0.250999s

lib/librumpclient/t_fd

2.927239s

bigenough

Passed

N/A

0.844807s

sigio

Passed

N/A

2.001724s

lib/librumpclient/t_exec

0.024081s

lib/librumphijack/t_asyncio

8.435108s

invafd

Passed

N/A

3.278631s

select_allunset

Passed

N/A

2.740563s

select_timeout

Passed

N/A

2.296197s

lib/librumphijack/t_config

2.442963s

fdoff

Passed

N/A

2.372688s

lib/librumphijack/t_cwd

24.186931s

basic_chdir

Passed

N/A

2.327155s

basic_fchdir

Passed

N/A

3.446619s

slash_chdir

Passed

N/A

2.287085s

slash_fchdir

Passed

N/A

2.631539s

symlink_chdir

Passed

N/A

2.823810s

symlink_fchdir

Passed

N/A

2.546529s

symlink_slash_chdir

Passed

N/A

3.964842s

symlink_slash_fchdir

Passed

N/A

3.793623s

lib/librumphijack/t_sh

9.122298s

redirect

Failed

atf-check failed; see the output of the test for details

4.336309s

runscript

Failed

atf-check failed; see the output of the test for details

4.640060s

lib/librumphijack/t_tcpip

32.668396s

http

Passed

N/A

6.506132s

nfs

Failed

atf-check failed; see the output of the test for details

9.430994s

nfs_autoload

Failed

atf-check failed; see the output of the test for details

8.537476s

ssh

Expected failure

PR lib/50174: atf-check failed; see the output of the test for details

7.945929s

lib/librumphijack/t_vfs

39.207581s

blanket

Passed

N/A

2.367830s

cpcopy

Passed

N/A

6.324800s

doubleblanket

Passed

N/A

3.254502s

ln_nox

Passed

N/A

5.676823s

ln_x

Passed

N/A

2.381385s

mv_nox

Passed

N/A

5.576577s

mv_x

Passed

N/A

3.802199s

paxcopy

Passed

N/A

6.829997s

runonprefix

Passed

N/A

2.576528s

lib/libdes/t_des

1.577366s

align

Passed

N/A

0.116241s

cbc

Passed

N/A

0.086488s

cbc_cksum

Passed

N/A

0.091030s

cbcm

Passed

N/A

0.199323s

cfb

Passed

N/A

0.165845s

desx_cbc

Passed

N/A

0.053960s

ecb

Passed

N/A

0.054008s

ede_cbc

Passed

N/A

0.053852s

ede_ecb

Passed

N/A

0.053087s

ede_ofb64

Passed

N/A

0.110867s

fast_crypt

Passed

N/A

0.125926s

ofb

Passed

N/A

0.079333s

ofb64

Passed

N/A

0.070005s

pcbc

Passed

N/A

0.073615s

quad_cksum

Passed

N/A

0.069152s

lib/libskey/t_algorithms

0.958390s

md4

Passed

N/A

0.162945s

md5

Passed

N/A

0.057730s

sha1

Passed

N/A

0.671395s

lib/libsljit/t_sljit

1.148418s

sljit

Passed

N/A

1.092111s

lib/libbpfjit/t_bpfjit

24.453635s

libbpfjit_abc_ja

Passed

N/A

0.171005s

libbpfjit_abc_ja_over

Passed

N/A

0.102543s

libbpfjit_abc_ld_chain

Passed

N/A

0.165800s

libbpfjit_alu_add_k

Passed

N/A

0.144559s

libbpfjit_alu_add_x

Passed

N/A

0.102090s

libbpfjit_alu_and_k

Passed

N/A

0.100393s

libbpfjit_alu_and_x

Passed

N/A

0.104337s

libbpfjit_alu_div0_k

Passed

N/A

0.173011s

libbpfjit_alu_div0_x

Passed

N/A

0.162076s

libbpfjit_alu_div10000_k

Passed

N/A

0.118302s

libbpfjit_alu_div10000_x

Passed

N/A

0.169924s

libbpfjit_alu_div10_k

Passed

N/A

0.289004s

libbpfjit_alu_div10_x

Passed

N/A

0.228180s

libbpfjit_alu_div1_k

Passed

N/A

0.141099s

libbpfjit_alu_div1_x

Passed

N/A

0.146295s

libbpfjit_alu_div2_k

Passed

N/A

0.281517s

libbpfjit_alu_div2_x

Passed

N/A

0.213654s

libbpfjit_alu_div4_k

Passed

N/A

0.151319s

libbpfjit_alu_div4_x

Passed

N/A

0.168123s

libbpfjit_alu_div7609801_k

Passed

N/A

0.273132s

libbpfjit_alu_div7609801_x

Passed

N/A

0.209697s

libbpfjit_alu_div80000000_k

Passed

N/A

0.136938s

libbpfjit_alu_div80000000_x

Passed

N/A

0.133659s

libbpfjit_alu_lsh0_k

Passed

N/A

0.233522s

libbpfjit_alu_lsh0_x

Passed

N/A

0.236065s

libbpfjit_alu_lsh_k

Passed

N/A

0.153871s

libbpfjit_alu_lsh_x

Passed

N/A

0.151741s

libbpfjit_alu_mod0_k

Passed

N/A

0.132274s

libbpfjit_alu_mod0_x

Passed

N/A

0.173596s

libbpfjit_alu_mod10000_k

Passed

N/A

0.184416s

libbpfjit_alu_mod10000_x

Passed

N/A

0.163601s

libbpfjit_alu_mod10_k

Passed

N/A

0.146031s

libbpfjit_alu_mod10_x

Passed

N/A

0.296605s

libbpfjit_alu_mod1_k

Passed

N/A

0.224312s

libbpfjit_alu_mod1_x

Passed

N/A

0.172125s

libbpfjit_alu_mod2_k

Passed

N/A

0.169526s

libbpfjit_alu_mod2_x

Passed

N/A

0.246864s

libbpfjit_alu_mod4_k

Passed

N/A

0.221642s

libbpfjit_alu_mod4_x

Passed

N/A

0.164627s

libbpfjit_alu_mod7609801_k

Passed

N/A

0.143532s

libbpfjit_alu_mod7609801_x

Passed

N/A

0.144043s

libbpfjit_alu_mod80000000_k

Passed

N/A

0.178189s

libbpfjit_alu_mod80000000_x

Passed

N/A

0.193521s

libbpfjit_alu_modulo_k

Passed

N/A

0.192372s

libbpfjit_alu_modulo_x

Passed

N/A

0.156997s

libbpfjit_alu_mul_k

Passed

N/A

0.268039s

libbpfjit_alu_mul_x

Passed

N/A

0.213177s

libbpfjit_alu_neg

Passed

N/A

0.155586s

libbpfjit_alu_or_k

Passed

N/A

0.160049s

libbpfjit_alu_or_x

Passed

N/A

0.285548s

libbpfjit_alu_rsh0_k

Passed

N/A

0.206106s

libbpfjit_alu_rsh0_x

Passed

N/A

0.164280s

libbpfjit_alu_rsh_k

Passed

N/A

0.162100s

libbpfjit_alu_rsh_x

Passed

N/A

0.262755s

libbpfjit_alu_sub_k

Passed

N/A

0.218953s

libbpfjit_alu_sub_x

Passed

N/A

0.173088s

libbpfjit_alu_xor_k

Passed

N/A

0.291718s

libbpfjit_alu_xor_x

Passed

N/A

0.256877s

libbpfjit_bad_ret_k

Passed

N/A

0.218837s

libbpfjit_cop_no_ctx

Passed

N/A

0.136604s

libbpfjit_copx_no_ctx

Passed

N/A

0.110568s

libbpfjit_empty

Passed

N/A

0.139019s

libbpfjit_examples_1

Passed

N/A

0.304572s

libbpfjit_examples_2

Passed

N/A

0.272343s

libbpfjit_examples_3

Passed

N/A

0.210507s

libbpfjit_jmp_ja

Passed

N/A

0.169284s

libbpfjit_jmp_ja_invalid

Passed

N/A

0.247912s

libbpfjit_jmp_ja_overflow

Passed

N/A

0.200753s

libbpfjit_jmp_jeq_k

Passed

N/A

0.189544s

libbpfjit_jmp_jeq_x

Passed

N/A

0.186964s

libbpfjit_jmp_jeq_x_noinit_a

Passed

N/A

0.288500s

libbpfjit_jmp_jeq_x_noinit_ax

Passed

N/A

0.214246s

libbpfjit_jmp_jeq_x_noinit_x

Passed

N/A

0.157267s

libbpfjit_jmp_jge_k

Passed

N/A

0.171244s

libbpfjit_jmp_jge_x

Passed

N/A

0.267637s

libbpfjit_jmp_jgt_k

Passed

N/A

0.253407s

libbpfjit_jmp_jgt_x

Passed

N/A

0.187166s

libbpfjit_jmp_jset_k

Passed

N/A

0.190548s

libbpfjit_jmp_jset_x

Passed

N/A

0.199875s

libbpfjit_jmp_modulo_k

Passed

N/A

0.328427s

libbpfjit_jmp_modulo_x

Passed

N/A

0.288362s

libbpfjit_ld_abs

Passed

N/A

0.239141s

libbpfjit_ld_abs_k_overflow

Passed

N/A

0.175356s

libbpfjit_ld_imm

Passed

N/A

0.300874s

libbpfjit_ld_ind

Passed

N/A

0.271838s

libbpfjit_ld_ind_k_overflow

Passed

N/A

0.179497s

libbpfjit_ld_ind_x_overflow1

Passed

N/A

0.177574s

libbpfjit_ld_ind_x_overflow2

Passed

N/A

0.309862s

libbpfjit_ld_len

Passed

N/A

0.221272s

libbpfjit_ldx_imm1

Passed

N/A

0.166710s

libbpfjit_ldx_imm2

Passed

N/A

0.184020s

libbpfjit_ldx_len1

Passed

N/A

0.313252s

libbpfjit_ldx_len2

Passed

N/A

0.230703s

libbpfjit_ldx_msh

Passed

N/A

0.172301s

libbpfjit_misc_tax

Passed

N/A

0.165740s

libbpfjit_misc_txa

Passed

N/A

0.306417s

libbpfjit_opt_ld_abs_1

Passed

N/A

0.274633s

libbpfjit_opt_ld_abs_2

Passed

N/A

0.209515s

libbpfjit_opt_ld_abs_3

Passed

N/A

0.202333s

libbpfjit_opt_ld_ind_1

Passed

N/A

0.308299s

libbpfjit_opt_ld_ind_2

Passed

N/A

0.311050s

libbpfjit_opt_ld_ind_3

Passed

N/A

0.321961s

libbpfjit_opt_ld_ind_4

Passed

N/A

0.209834s

libbpfjit_ret_k

Passed

N/A

0.170166s

libbpfjit_st1

Passed

N/A

0.141472s

libbpfjit_st2

Passed

N/A

0.099745s

libbpfjit_st3

Passed

N/A

0.108849s

libbpfjit_st4

Passed

N/A

0.197259s

libbpfjit_st5

Passed

N/A

0.308917s

libbpfjit_stx1

Passed

N/A

0.124346s

libbpfjit_stx2

Passed

N/A

0.135459s

libbpfjit_stx3

Passed

N/A

0.296318s

libbpfjit_stx4

Passed

N/A

0.291276s

lib/libbpfjit/t_extmem

1.226883s

libbpfjit_cop_ret_mem

Passed

N/A

0.115775s

libbpfjit_cop_ret_preinited_mem

Passed

N/A

0.116553s

libbpfjit_copx_ret_mem

Passed

N/A

0.220328s

libbpfjit_copx_ret_preinited_mem

Passed

N/A

0.151140s

libbpfjit_extmem_invalid_load

Passed

N/A

0.066158s

libbpfjit_extmem_invalid_store

Passed

N/A

0.061229s

libbpfjit_extmem_load_default

Passed

N/A

0.066911s

libbpfjit_extmem_load_preinited

Passed

N/A

0.118606s

libbpfjit_extmem_side_effect

Passed

N/A

0.120793s

libbpfjit_extmem_store

Passed

N/A

0.071294s

lib/libbpfjit/t_cop

1.881127s

libbpfjit_cop_copx

Passed

N/A

0.085913s

libbpfjit_cop_invalid_index

Passed

N/A

0.130789s

libbpfjit_cop_no_ctx

Passed

N/A

0.096461s

libbpfjit_cop_ret_A

Passed

N/A

0.069293s

libbpfjit_cop_ret_buflen

Passed

N/A

0.067316s

libbpfjit_cop_ret_nfuncs

Passed

N/A

0.068353s

libbpfjit_cop_ret_wirelen

Passed

N/A

0.069983s

libbpfjit_cop_side_effect

Passed

N/A

0.144854s

libbpfjit_copx_cop

Passed

N/A

0.119311s

libbpfjit_copx_invalid_index

Passed

N/A

0.075148s

libbpfjit_copx_no_ctx

Passed

N/A

0.061252s

libbpfjit_copx_ret_A

Passed

N/A

0.076012s

libbpfjit_copx_ret_buflen

Passed

N/A

0.148719s

libbpfjit_copx_ret_nfuncs

Passed

N/A

0.276526s

libbpfjit_copx_ret_wirelen

Passed

N/A

0.123189s

libbpfjit_copx_side_effect

Passed

N/A

0.131510s

libexec/ld.elf_so/t_dlerror-cleared

0.327038s

rtld_dlerror_cleared

Passed

N/A

0.264636s

libexec/ld.elf_so/t_dlerror-false

0.134488s

rtld_dlerror_false

Passed

N/A

0.116200s

libexec/ld.elf_so/t_dlinfo

0.495991s

rtld_dlinfo_linkmap_dlopen

Passed

N/A

0.170445s

rtld_dlinfo_linkmap_dlopen_iter

Passed

N/A

0.085548s

rtld_dlinfo_linkmap_inval

Passed

N/A

0.075196s

rtld_dlinfo_linkmap_self

Passed

N/A

0.083230s

libexec/ld.elf_so/t_dlvsym

0.623180s

rtld_dlvsym_symbol_nonexistent

Passed

N/A

0.088048s

rtld_dlvsym_v1

Passed

N/A

0.241241s

rtld_dlvsym_v3

Passed

N/A

0.090915s

rtld_dlvsym_version_nonexistent

Passed

N/A

0.064159s

rtld_dlvsym_version_null

Passed

N/A

0.064442s

libexec/ld.elf_so/t_ifunc

0.457154s

rtld_ifunc

Passed

N/A

0.423771s

libexec/ld.elf_so/t_df_1_noopen

1.758474s

df_1_noopen1

Passed

N/A

0.937746s

df_1_noopen2

Passed

N/A

0.760741s

libexec/ld.elf_so/t_dl_symver

3.274662s

dl_symver

Passed

N/A

3.221714s

net/fdpass/t_fdpass

3.593512s

fdpass_compat

Passed

N/A

0.967219s

fdpass_compat_normal

Passed

N/A

0.914330s

fdpass_normal

Passed

N/A

0.811054s

fdpass_normal_compat

Passed

N/A

0.791342s

net/in_cksum/t_in_cksum

195.710302s

mbufs_aligned

Passed

N/A

51.938478s

mbufs_unaligned

Passed

N/A

58.520881s

sizes_aligned

Passed

N/A

43.457795s

sizes_unaligned

Passed

N/A

41.601426s

net/net/t_unix

0.242353s

sockaddr_un_closed

Passed

N/A

0.082830s

sockaddr_un_len_exceed

Passed

N/A

0.051543s

sockaddr_un_len_max

Passed

N/A

0.062003s

net/net/t_tcp

0.293085s

fcntl_reset_nonblock

Passed

N/A

0.118255s

paccept_nonblock

Passed

N/A

0.087206s

paccept_reset_nonblock

Passed

N/A

0.051391s

net/net/t_udp

0.251124s

udp4_send

Passed

N/A

0.071870s

udp6_send

Passed

N/A

0.141329s

net/net/t_pktinfo

0.079073s

pktinfo

Passed

N/A

0.067980s

net/net/t_raw

1.009074s

PRU_SENSE

Passed

N/A

0.972187s

net/net/t_forwarding

184.256733s

basic

Failed

Test case exited normally but failed to create the results file: Failed to open /tmp/atf-run.ErA1U9/tcr

2.083336s

basic6

Passed

N/A

58.958731s

fastforward

Passed

N/A

32.485937s

fastforward6

Passed

N/A

39.865488s

misc

Failed

atf-check failed; see the output of the test for details

50.490444s

net/net/t_ipaddress

29.009570s

ipaddr_same_address

Passed

N/A

27.427467s

ipaddr_same_address6

Failed

atf-check failed; see the output of the test for details

1.496240s

net/net/t_ipv6address

64.515787s

linklocal

Failed

atf-check failed; see the output of the test for details

31.349964s

linklocal_ops

Passed

N/A

32.976414s

net/net/t_ipv6_lifetime

60.078299s

basic

Failed

atf-check failed; see the output of the test for details

59.957905s

net/sys/t_rfc6056

0.491202s

inet4

Passed

N/A

0.296677s

inet6

Passed

N/A

0.146397s

net/arp/t_arp

216.943157s

cache_expiration_10s

Passed

N/A

42.413568s

cache_expiration_5s

Passed

N/A

31.992314s

cache_overwriting

Passed

N/A

17.150688s

command

Failed

atf-check failed; see the output of the test for details

9.408219s

garp

Passed

N/A

14.703396s

link_activation

Passed

N/A

26.753207s

proxy_arp_pub

Passed

N/A

47.859545s

proxy_arp_pubproxy

Failed

atf-check failed; see the output of the test for details

6.795094s

static_arp

Passed

N/A

19.147817s

net/arp/t_dad

57.687185s

dad_basic

Passed

N/A

33.079175s

dad_duplicated

Passed

N/A

24.362264s

net/bpf/t_bpf

1.574428s

bpfwriteleak

Passed

N/A

1.511940s

net/bpf/t_div-by-zero

1.391038s

div_by_zero

Passed

N/A

1.330973s

net/bpf/t_mbuf

30.110800s

bpf_mbuf_ldb_abs

Passed

N/A

1.355053s

bpf_mbuf_ldb_abs_overflow

Passed

N/A

1.425069s

bpf_mbuf_ldb_ind

Passed

N/A

1.542679s

bpf_mbuf_ldb_ind_overflow1

Passed

N/A

1.323007s

bpf_mbuf_ldb_ind_overflow2

Passed

N/A

1.463481s

bpf_mbuf_ldb_ind_overflow3

Passed

N/A

1.434934s

bpf_mbuf_ldh_abs

Passed

N/A

1.394005s

bpf_mbuf_ldh_abs_overflow

Passed

N/A

1.435559s

bpf_mbuf_ldh_ind

Passed

N/A

1.479714s

bpf_mbuf_ldh_ind_overflow1

Passed

N/A

1.467694s

bpf_mbuf_ldh_ind_overflow2

Passed

N/A

1.403141s

bpf_mbuf_ldh_ind_overflow3

Passed

N/A

1.467124s

bpf_mbuf_ldw_abs

Passed

N/A

1.554710s

bpf_mbuf_ldw_abs_overflow

Passed

N/A

1.569354s

bpf_mbuf_ldw_ind

Passed

N/A

1.449274s

bpf_mbuf_ldw_ind_overflow1

Passed

N/A

1.439158s

bpf_mbuf_ldw_ind_overflow2

Passed

N/A

1.384164s

bpf_mbuf_ldw_ind_overflow3

Passed

N/A

1.489145s

bpf_mbuf_msh

Passed

N/A

1.584652s

bpf_mbuf_msh_overflow

Passed

N/A

1.484383s

net/bpfilter/t_bpfilter

15.838007s

bpfilterbadjmp

Passed

N/A

1.577256s

bpfilterbadmem

Passed

N/A

1.558313s

bpfilterbadret

Passed

N/A

1.610876s

bpfiltercontig

Passed

N/A

2.735011s

bpfiltermchain

Passed

N/A

3.005892s

bpfilternegjmp

Passed

N/A

1.663808s

bpfilternoinitA

Passed

N/A

1.536524s

bpfilternoinitX

Passed

N/A

1.533530s

net/carp/t_basic

17.219043s

handover

Passed

N/A

17.117646s

net/icmp/t_forward

4.814129s

returndatabytes

Passed

N/A

4.714607s

net/icmp/t_ping

179.947623s

floodping

Passed

N/A

40.871719s

floodping2

Passed

N/A

71.505782s

ping_of_death

Passed

N/A

3.309055s

pingsize

Passed

N/A

59.723873s

simpleping

Passed

N/A

4.233353s

net/icmp/t_ping2

15.454121s

basic

Passed

N/A

15.366194s

net/icmp/t_icmp_redirect

96.022927s

icmp_redirect

Passed

N/A

43.776237s

icmp_redirect_timeout

Passed

N/A

52.081906s

net/icmp/t_icmp6_redirect

60.798799s

basic

Passed

N/A

60.679296s

net/if/t_compat

1.762142s

OOSIOCGIFBRDADDR

Passed

N/A

1.695836s

net/if/t_ifconf

12.758346s

basic

Failed

atf-check failed; see the output of the test for details

12.642972s

net/if/t_ifconfig

129.670511s

create_destroy

Passed

N/A

10.949663s

options

Passed

N/A

43.753757s

parameters

Passed

N/A

74.683297s

net/if_bridge/t_bridge

252.345691s

basic

Failed

atf-check failed; see the output of the test for details

17.497538s

basic6

Passed

N/A

72.840927s

member_ip

Failed

atf-check failed; see the output of the test for details

47.056298s

member_ip6

Passed

N/A

83.404862s

rtable

Passed

N/A

31.219974s

net/if_gif/t_gif

471.989539s

basicipv4overipv4

Passed

N/A

40.583546s

basicipv4overipv6

Failed

atf-check failed; see the output of the test for details

12.562625s

basicipv6overipv4

Passed

N/A

63.132493s

basicipv6overipv6

Failed

atf-check failed; see the output of the test for details

15.554367s

ioctlipv4overipv4

Passed

N/A

50.012992s

ioctlipv4overipv6

Failed

atf-check failed; see the output of the test for details

40.919521s

ioctlipv6overipv4

Passed

N/A

56.440417s

ioctlipv6overipv6

Passed

N/A

61.544579s

recursiveipv4overipv4

Passed

N/A

42.520482s

recursiveipv4overipv6

Passed

N/A

41.435613s

recursiveipv6overipv4

Passed

N/A

45.037219s

recursiveipv6overipv6

Failed

Test program received signal 11 (core dumped)

1.581225s

net/if_loop/t_pr

2.362513s

loopmtu

Passed

N/A

1.135904s

loopmtu_csum

Passed

N/A

1.130556s

net/if_pppoe/t_pppoe

42.797578s

pap

Passed

N/A

42.732485s

net/if_tap/t_tap

38.781344s

bridged

Passed

N/A

16.103637s

create_destroy

Passed

N/A

5.440205s

stand_alone

Passed

N/A

17.053632s

net/mcast/t_mcast

52.433047s

mcast_conninet4

Passed

N/A

7.476891s

mcast_conninet6

Passed

N/A

7.656149s

mcast_connmappedbuginet4

Passed

N/A

8.181380s

mcast_connmappedinet4

Passed

N/A

7.014639s

mcast_unconninet4

Failed

Test case exited normally but failed to create the results file: Failed to open /tmp/atf-run.BmcVJG/tcr

1.089681s

mcast_unconninet6

Passed

N/A

6.657074s

mcast_unconnmappedbuginet4

Passed

N/A

6.935452s

mcast_unconnmappedinet4

Passed

N/A

7.111643s

net/mpls/t_mpls_fw

63.074892s

mplsfw4

Passed

N/A

27.299067s

mplsfw4_expl

Passed

N/A

35.620730s

net/mpls/t_mpls_fw6

90.974910s

mplsfw6

Passed

N/A

40.393468s

mplsfw6_expl

Passed

N/A

50.411445s

net/mpls/t_mpls_fw64

76.252640s

mplsfw64_expl

Failed

atf-check failed; see the output of the test for details

33.058351s

mplsfw64_impl

Passed

N/A

43.020190s

net/mpls/t_rfc4182

13.608752s

rfc4182

Failed

atf-check failed; see the output of the test for details

13.538417s

net/mpls/t_ldp_regen

1.746737s

ldp_regen

Skipped

unreliable under qemu, skip until PR kern/43997 fixed

1.710027s

net/ndp/t_dad

40.415613s

dad_basic

Passed

N/A

19.932270s

dad_duplicated

Passed

N/A

20.383169s

net/ndp/t_ndp

195.820040s

cache_expiration

Passed

N/A

75.391786s

cache_overwriting

Passed

N/A

25.630788s

command

Failed

atf-check failed; see the output of the test for details

27.612648s

link_activation

Passed

N/A

30.759016s

neighborgcthresh

Passed

N/A

36.191601s

net/ndp/t_ra

33.420540s

basic

Failed

atf-check failed; see the output of the test for details

33.307976s

net/npf/t_npf

11.170950s

npf_bpf

Passed

N/A

1.649709s

npf_nat

Passed

N/A

1.689783s

npf_nbuf

Passed

N/A

1.729194s

npf_rule

Passed

N/A

1.739021s

npf_state

Passed

N/A

2.005986s

npf_table

Passed

N/A

2.168972s

net/route/t_change

4.928619s

reject2blackhole

Passed

N/A

4.871406s

net/route/t_flags

129.841092s

route_flags_announce

Passed

N/A

11.754042s

route_flags_blackhole

Passed

N/A

15.311930s

route_flags_connected

Passed

N/A

11.380379s

route_flags_default_gateway

Passed

N/A

10.760512s

route_flags_icmp_redirect

Passed

N/A

32.365842s

route_flags_lo

Passed

N/A

10.544321s

route_flags_reject

Passed

N/A

25.308100s

route_flags_static

Passed

N/A

11.952116s

net/route/t_flags6

102.177417s

route_flags_announce

Passed

N/A

11.938350s

route_flags_blackhole

Passed

N/A

16.579799s

route_flags_connected

Passed

N/A

11.583872s

route_flags_default_gateway

Passed

N/A

13.504135s

route_flags_lo

Passed

N/A

13.164560s

route_flags_reject

Passed

N/A

20.349252s

route_flags_static

Passed

N/A

14.407782s

net/route/t_route

45.007155s

command_get

Failed

atf-check failed; see the output of the test for details

23.556079s

command_get6

Failed

atf-check failed; see the output of the test for details

5.879445s

non_subnet_gateway

Passed

N/A

15.369569s

net/bpfjit/t_bpfjit

61.405100s

bpfjit_abc_ja

Passed

N/A

0.558291s

bpfjit_abc_ja_over

Passed

N/A

0.588574s

bpfjit_abc_ld_chain

Passed

N/A

0.318222s

bpfjit_alu_add_k

Passed

N/A

0.387481s

bpfjit_alu_add_x

Passed

N/A

0.613788s

bpfjit_alu_and_k

Passed

N/A

0.502374s

bpfjit_alu_and_x

Passed

N/A

0.585696s

bpfjit_alu_div0_k

Passed

N/A

0.303687s

bpfjit_alu_div0_x

Passed

N/A

0.345588s

bpfjit_alu_div10000_k

Passed

N/A

0.455620s

bpfjit_alu_div10000_x

Passed

N/A

0.488575s

bpfjit_alu_div10_k

Passed

N/A

0.510421s

bpfjit_alu_div10_x

Passed

N/A

0.441291s

bpfjit_alu_div1_k

Passed

N/A

0.529768s

bpfjit_alu_div1_x

Passed

N/A

0.515357s

bpfjit_alu_div2_k

Passed

N/A

0.438262s

bpfjit_alu_div2_x

Passed

N/A

0.397018s

bpfjit_alu_div4_k

Passed

N/A

0.535321s

bpfjit_alu_div4_x

Passed

N/A

0.521353s

bpfjit_alu_div7609801_k

Passed

N/A

0.613002s

bpfjit_alu_div7609801_x

Passed

N/A

0.693744s

bpfjit_alu_div80000000_k

Passed

N/A

0.491266s

bpfjit_alu_div80000000_x

Passed

N/A

0.530906s

bpfjit_alu_lsh0_k

Passed

N/A

0.515379s

bpfjit_alu_lsh0_x

Passed

N/A

0.541997s

bpfjit_alu_lsh_k

Passed

N/A

0.689276s

bpfjit_alu_lsh_x

Passed

N/A

0.707638s

bpfjit_alu_mod0_k

Passed

N/A

0.672322s

bpfjit_alu_mod0_x

Passed

N/A

0.504449s

bpfjit_alu_mod10000_k

Passed

N/A

0.582484s

bpfjit_alu_mod10000_x

Passed

N/A

0.390599s

bpfjit_alu_mod10_k

Passed

N/A

0.439929s

bpfjit_alu_mod10_x

Passed

N/A

0.503080s

bpfjit_alu_mod1_k

Passed

N/A

0.398985s

bpfjit_alu_mod1_x

Passed

N/A

0.392413s

bpfjit_alu_mod2_k

Passed

N/A

0.498334s

bpfjit_alu_mod2_x

Passed

N/A

0.671192s

bpfjit_alu_mod4_k

Passed

N/A

0.662406s

bpfjit_alu_mod4_x

Passed

N/A

0.473788s

bpfjit_alu_mod7609801_k

Passed

N/A

0.356189s

bpfjit_alu_mod7609801_x

Passed

N/A

0.359254s

bpfjit_alu_mod80000000_k

Passed

N/A

0.506337s

bpfjit_alu_mod80000000_x

Passed

N/A

0.463560s

bpfjit_alu_modulo_k

Passed

N/A

0.619056s

bpfjit_alu_modulo_x

Passed

N/A

0.664785s

bpfjit_alu_mul_k

Passed

N/A

0.484625s

bpfjit_alu_mul_x

Passed

N/A

0.575848s

bpfjit_alu_neg

Passed

N/A

0.569328s

bpfjit_alu_or_k

Passed

N/A

0.571776s

bpfjit_alu_or_x

Passed

N/A

0.397584s

bpfjit_alu_rsh0_k

Passed

N/A

0.303469s

bpfjit_alu_rsh0_x

Passed

N/A

0.425498s

bpfjit_alu_rsh_k

Passed

N/A

0.450676s

bpfjit_alu_rsh_x

Passed

N/A

0.402785s

bpfjit_alu_sub_k

Passed

N/A

0.512914s

bpfjit_alu_sub_x

Passed

N/A

0.441218s

bpfjit_alu_xor_k

Passed

N/A

0.573532s

bpfjit_alu_xor_x

Passed

N/A

0.577083s

bpfjit_bad_ret_k

Passed

N/A

0.402865s

bpfjit_cop_no_ctx

Passed

N/A

0.385776s

bpfjit_copx_no_ctx

Passed

N/A

0.299849s

bpfjit_empty

Passed

N/A

0.341286s

bpfjit_examples_1

Passed

N/A

0.392304s

bpfjit_examples_2

Passed

N/A

0.575405s

bpfjit_examples_3

Passed

N/A

0.569210s

bpfjit_jmp_ja

Passed

N/A

0.686547s

bpfjit_jmp_ja_invalid

Passed

N/A

0.517864s

bpfjit_jmp_ja_overflow

Passed

N/A

0.616143s

bpfjit_jmp_jeq_k

Passed

N/A

0.696296s

bpfjit_jmp_jeq_x

Passed

N/A

0.590503s

bpfjit_jmp_jeq_x_noinit_a

Passed

N/A

0.462440s

bpfjit_jmp_jeq_x_noinit_ax

Passed

N/A

0.606915s

bpfjit_jmp_jeq_x_noinit_x

Passed

N/A

0.481849s

bpfjit_jmp_jge_k

Passed

N/A

0.575909s

bpfjit_jmp_jge_x

Passed

N/A

0.565316s

bpfjit_jmp_jgt_k

Passed

N/A

0.558995s

bpfjit_jmp_jgt_x

Passed

N/A

0.555091s

bpfjit_jmp_jset_k

Passed

N/A

0.461656s

bpfjit_jmp_jset_x

Passed

N/A

0.457141s

bpfjit_jmp_modulo_k

Passed

N/A

0.374430s

bpfjit_jmp_modulo_x

Passed

N/A

0.543649s

bpfjit_ld_abs

Passed

N/A

0.457356s

bpfjit_ld_abs_k_overflow

Passed

N/A

0.554597s

bpfjit_ld_imm

Passed

N/A

0.528315s

bpfjit_ld_ind

Passed

N/A

0.578527s

bpfjit_ld_ind_k_overflow

Passed

N/A

0.646793s

bpfjit_ld_ind_x_overflow1

Passed

N/A

0.619696s

bpfjit_ld_ind_x_overflow2

Passed

N/A

0.547557s

bpfjit_ld_len

Passed

N/A

0.550595s

bpfjit_ldx_imm1

Passed

N/A

0.493997s

bpfjit_ldx_imm2

Passed

N/A

0.577752s

bpfjit_ldx_len1

Passed

N/A

0.663895s

bpfjit_ldx_len2

Passed

N/A

0.674409s

bpfjit_ldx_msh

Passed

N/A

0.542156s

bpfjit_misc_tax

Passed

N/A

0.473875s

bpfjit_misc_txa

Passed

N/A

0.468726s

bpfjit_opt_ld_abs_1

Passed

N/A

0.488586s

bpfjit_opt_ld_abs_2

Passed

N/A

0.406372s

bpfjit_opt_ld_abs_3

Passed

N/A

0.617587s

bpfjit_opt_ld_ind_1

Passed

N/A

0.545476s

bpfjit_opt_ld_ind_2

Passed

N/A

0.487660s

bpfjit_opt_ld_ind_3

Passed

N/A

0.463734s

bpfjit_opt_ld_ind_4

Passed

N/A

0.583632s

bpfjit_ret_k

Passed

N/A

0.599968s

bpfjit_st1

Passed

N/A

0.591994s

bpfjit_st2

Passed

N/A

0.485931s

bpfjit_st3

Passed

N/A

0.476858s

bpfjit_st4

Passed

N/A

0.548335s

bpfjit_st5

Passed

N/A

0.593496s

bpfjit_stx1

Passed

N/A

0.626179s

bpfjit_stx2

Passed

N/A

0.469173s

bpfjit_stx3

Passed

N/A

0.660228s

bpfjit_stx4

Passed

N/A

0.515365s

net/bpfjit/t_cop

6.856624s

bpfjit_cop_copx

Passed

N/A

0.291798s

bpfjit_cop_invalid_index

Passed

N/A

0.318554s

bpfjit_cop_no_ctx

Passed

N/A

0.373320s

bpfjit_cop_ret_A

Passed

N/A

0.432980s

bpfjit_cop_ret_buflen

Passed

N/A

0.367671s

bpfjit_cop_ret_nfuncs

Passed

N/A

0.457719s

bpfjit_cop_ret_wirelen

Passed

N/A

0.587189s

bpfjit_cop_side_effect

Passed

N/A

0.500148s

bpfjit_copx_cop

Passed

N/A

0.360383s

bpfjit_copx_invalid_index

Passed

N/A

0.524612s

bpfjit_copx_no_ctx

Passed

N/A

0.381320s

bpfjit_copx_ret_A

Passed

N/A

0.288341s

bpfjit_copx_ret_buflen

Passed

N/A

0.476552s

bpfjit_copx_ret_nfuncs

Passed

N/A

0.425779s

bpfjit_copx_ret_wirelen

Passed

N/A

0.433813s

bpfjit_copx_side_effect

Passed

N/A

0.302397s

net/bpfjit/t_extmem

3.931072s

bpfjit_cop_ret_mem

Passed

N/A

0.421605s

bpfjit_cop_ret_preinited_mem

Passed

N/A

0.418709s

bpfjit_copx_ret_mem

Passed

N/A

0.443504s

bpfjit_copx_ret_preinited_mem

Passed

N/A

0.365933s

bpfjit_extmem_invalid_load

Passed

N/A

0.356064s

bpfjit_extmem_invalid_store

Passed

N/A

0.342640s

bpfjit_extmem_load_preinited

Passed

N/A

0.383837s

bpfjit_extmem_side_effect

Passed

N/A

0.606582s

bpfjit_extmem_store

Passed

N/A

0.349824s

net/bpfjit/t_mbuf

9.986292s

bpfjit_mbuf_ldb_abs

Passed

N/A

0.288466s

bpfjit_mbuf_ldb_abs_overflow

Passed

N/A

0.317758s

bpfjit_mbuf_ldb_ind

Passed

N/A

0.386145s

bpfjit_mbuf_ldb_ind_overflow1

Passed

N/A

0.382288s

bpfjit_mbuf_ldb_ind_overflow2

Passed

N/A

0.270751s

bpfjit_mbuf_ldb_ind_overflow3

Passed

N/A

0.321000s

bpfjit_mbuf_ldh_abs

Passed

N/A

0.349394s

bpfjit_mbuf_ldh_abs_overflow

Passed

N/A

0.456875s

bpfjit_mbuf_ldh_ind

Passed

N/A

0.573590s

bpfjit_mbuf_ldh_ind_overflow1

Passed

N/A

0.485565s

bpfjit_mbuf_ldh_ind_overflow2

Passed

N/A

0.592864s

bpfjit_mbuf_ldh_ind_overflow3

Passed

N/A

0.606691s

bpfjit_mbuf_ldw_abs

Passed

N/A

0.648595s

bpfjit_mbuf_ldw_abs_overflow

Passed

N/A

0.455020s

bpfjit_mbuf_ldw_ind

Passed

N/A

0.451978s

bpfjit_mbuf_ldw_ind_overflow1

Passed

N/A

0.449221s

bpfjit_mbuf_ldw_ind_overflow2

Passed

N/A

0.689847s

bpfjit_mbuf_ldw_ind_overflow3

Passed

N/A

0.663348s

bpfjit_mbuf_msh

Passed

N/A

0.500770s

bpfjit_mbuf_msh_overflow

Passed

N/A

0.578098s

sbin/fsck_ffs/t_enable_quotas

58.402119s

corrupt_be_1

Passed

N/A

3.306183s

corrupt_be_2

Failed

Test program received signal 11 (core dumped)

0.167912s

corrupt_le_1

Passed

N/A

3.706132s

corrupt_le_2

Passed

N/A

3.485568s

dir1_be_1

Passed

N/A

2.931366s

dir1_be_2

Passed

N/A

2.724302s

dir1_le_1

Passed

N/A

3.530667s

dir1_le_2

Passed

N/A

3.450375s

disable_be_1

Passed

N/A

3.088987s

disable_be_2

Passed

N/A

2.241671s

disable_le_1

Passed

N/A

2.621980s

disable_le_2

Passed

N/A

2.644131s

notreg_be_1

Passed

N/A

3.298390s

notreg_be_2

Passed

N/A

3.119500s

notreg_le_1

Passed

N/A

2.893732s

notreg_le_2

Passed

N/A

2.544873s

unallocated_be_1

Passed

N/A

2.996889s

unallocated_be_2

Passed

N/A

2.843908s

unallocated_le_1

Passed

N/A

3.389525s

unallocated_le_2

Passed

N/A

2.601327s

sbin/fsck_ffs/t_check_quotas

251.908640s

corrupt_list_be_1

Passed

N/A

2.948215s

corrupt_list_be_2

Passed

N/A

3.297723s

corrupt_list_le_1

Passed

N/A

3.196766s

corrupt_list_le_2

Passed

N/A

3.362607s

expand1_list_be_1

Passed

N/A

3.521627s

expand1_list_be_2

Passed

N/A

5.001744s

expand1_list_le_1

Passed

N/A

4.768305s

expand1_list_le_2

Passed

N/A

5.442589s

expand2_list_be_1

Failed

atf-check failed; see the output of the test for details

45.993784s

expand2_list_be_2

Passed

N/A

54.185887s

expand2_list_le_1

Passed

N/A

54.390224s

expand2_list_le_2

Passed

N/A

58.218354s

sbin/gpt/t_gpt

49.214121s

backup_2part

Passed

N/A

4.043167s

bootable_2part

Failed

atf-check failed; see the output of the test for details

3.333372s

change_attr_2part

Passed

N/A

4.661225s

change_type_2part

Passed

N/A

4.803480s

create_2part

Passed

N/A

3.290134s

create_empty

Passed

N/A

2.077435s

label_2part

Passed

N/A

3.560308s

migrate_disklabel

Passed

N/A

2.771811s

recover_backup

Passed

N/A

3.853958s

recover_primary

Passed

N/A

4.048109s

remove_2part

Passed

N/A

3.241485s

resize_2part

Passed

N/A

4.461857s

restore_2part

Passed

N/A

4.402826s

sbin/ifconfig/t_nonexistent

1.386622s

nonexistent

Passed

N/A

1.321851s

sbin/newfs/t_enable_quotas

22.301357s

enabled_be_1_both

Passed

N/A

1.997994s

enabled_be_1_group

Passed

N/A

1.698188s

enabled_be_1_user

Passed

N/A

1.912134s

enabled_be_2_both

Passed

N/A

1.648492s

enabled_be_2_group

Passed

N/A

1.845593s

enabled_be_2_user

Passed

N/A

1.861018s

enabled_le_1_both

Passed

N/A

1.855536s

enabled_le_1_group

Passed

N/A

1.764531s

enabled_le_1_user

Passed

N/A

1.783880s

enabled_le_2_both

Passed

N/A

1.788417s

enabled_le_2_group

Passed

N/A

1.689391s

enabled_le_2_user

Passed

N/A

1.820009s

sbin/newfs_msdos/t_create

2.210270s

validfat32

Passed

N/A

2.094150s

sbin/resize_ffs/t_check

3.642779s

check_grow

Passed

N/A

3.563556s

sbin/resize_ffs/t_grow

226.410206s

grow_16M_v0_8192

Passed

N/A

85.027812s

grow_16M_v1_16384

Failed

atf-check failed; see the output of the test for details

56.198952s

grow_16M_v2_32768

Passed

N/A

81.393002s

grow_ffsv1_partial_cg

Passed

N/A

3.211475s

sbin/resize_ffs/t_shrink

291.571637s

shrink_24M_16M_v0_32768

Passed

N/A

107.472199s

shrink_24M_16M_v1_65536

Passed

N/A

102.860597s

shrink_24M_16M_v2_4096

Expected failure

PR bin/44205: atf-check failed; see the output of the test for details

77.532172s

shrink_ffsv1_partial_cg

Passed

N/A

3.206030s

sbin/resize_ffs/t_grow_swapped

201.542076s

grow_16M_v0_65536

Passed

N/A

68.331023s

grow_16M_v1_4096

Failed

atf-check failed; see the output of the test for details

73.574547s

grow_16M_v2_8192

Passed

N/A

57.379633s

grow_ffsv1_partial_cg

Passed

N/A

1.716965s

sbin/resize_ffs/t_shrink_swapped

156.527808s

shrink_24M_16M_v0_4096

Failed

atf-check failed; see the output of the test for details

64.885356s

shrink_24M_16M_v1_8192

Failed

atf-check failed; see the output of the test for details

44.035208s

shrink_24M_16M_v2_16384

Expected failure

PR bin/44205: atf-check failed; see the output of the test for details

45.605679s

shrink_ffsv1_partial_cg

Passed

N/A

1.740658s

sbin/route/t_missing

0.794115s

missing

Passed

N/A

0.748790s

sbin/sysctl/t_perm

130.147173s

sysctl_ddb

Passed

N/A

4.679762s

sysctl_hw

Passed

N/A

38.615120s

sysctl_kern

Failed

atf-check failed; see the output of the test for details

10.554409s

sysctl_machdep

Passed

N/A

8.273726s

sysctl_net

Failed

atf-check failed; see the output of the test for details

44.534020s

sysctl_security

Passed

N/A

9.756329s

sysctl_vfs

Failed

atf-check failed; see the output of the test for details

11.000971s

sysctl_vm

Failed

atf-check failed; see the output of the test for details

2.441700s

sbin/sysctl/t_sysctl

1.558513s

basic

Passed

N/A

1.519270s

sys/net/t_print

0.239992s

dl_print

Passed

N/A

0.151560s

sdl_print

Failed

/tmp/bracket/build/2016.06.15.04.33.52-i386/src/tests/sys/net/t_print.c:151: buf != res (link#3 != [/0#]:3)

0.049188s

sys/netatalk/t_print

0.110503s

at_print

Passed

N/A

0.046993s

sat_print

Passed

N/A

0.050000s

sys/netinet/t_print

0.185118s

in_print

Passed

N/A

0.094284s

sin_print

Passed

N/A

0.048256s

sys/netinet6/t_print

0.111016s

in6_print

Passed

N/A

0.048993s

sin6_print

Passed

N/A

0.050441s

sys/rc/t_rc_d_cli

22.568081s

default_restart_no_args

Passed

N/A

2.936635s

default_restart_with_args

Passed

N/A

1.909866s

default_start_no_args

Passed

N/A

1.645353s

default_start_with_args

Passed

N/A

1.618949s

default_stop_no_args

Passed

N/A

1.565803s

default_stop_with_args

Passed

N/A

2.350020s

no_command

Passed

N/A

0.936765s

overriden_custom_no_args

Passed

N/A

1.137302s

overriden_custom_with_args

Passed

N/A

1.144145s

overriden_restart_no_args

Passed

N/A

1.195999s

overriden_restart_with_args

Passed

N/A

1.108411s

overriden_start_no_args

Passed

N/A

1.111189s

overriden_start_with_args

Passed

N/A

1.240826s

overriden_stop_no_args

Passed

N/A

1.179248s

overriden_stop_with_args

Passed

N/A

1.064282s

usr.bin/awk/t_awk

23.473084s

assign_NF

Passed

N/A

1.004812s

big_regexp

Passed

N/A

0.983221s

empty_rs

Passed

N/A

0.839014s

end

Passed

N/A

1.517070s

modify_subsep

Passed

N/A

0.928595s

multibyte

Passed

N/A

1.600657s

newline_rs

Passed

N/A

0.885831s

period

Passed

N/A

1.152263s

regex_caret_1_rs

Passed

N/A

0.890156s

regex_caret_2_rs

Passed

N/A

0.880880s

regex_dollar_1_rs

Passed

N/A

0.837509s

regex_dollar_2_rs

Passed

N/A

0.857745s

regex_or_1_rs

Passed

N/A

0.855270s

regex_or_2_rs

Passed

N/A

0.872368s

regex_or_3_rs

Passed

N/A

0.856485s

regex_reallocation_rs

Passed

N/A

1.140210s

regex_two_star_rs

Passed

N/A

0.855418s

single_char_regex_group_rs

Passed

N/A

0.883282s

single_char_regex_star_rs

Passed

N/A

0.848748s

single_char_rs

Passed

N/A

0.841946s

string1

Failed

atf-check failed; see the output of the test for details

0.839645s

two_char_regex_group_rs

Passed

N/A

0.837011s

two_char_regex_star_rs

Passed

N/A

0.859687s

two_char_rs

Passed

N/A

0.862945s

usr.bin/basename/t_basename

3.627174s

basic

Passed

N/A

2.221179s

suffix

Passed

N/A

1.323449s

usr.bin/bzip2/t_bzip2

3.922220s

basic

Passed

N/A

3.876303s

usr.bin/cc/t_hello

17.953337s

hello

Passed

N/A

4.261872s

hello32

Skipped

this is not a 64 bit architecture

1.553000s

hello_pic

Passed

N/A

7.183715s

hello_pie

Passed

N/A

4.810853s

usr.bin/cmp/t_cmp

2.808994s

missing

Passed

N/A

1.516189s

skip

Passed

N/A

1.239440s

usr.bin/config/t_config

13.409159s

deffs_redef

Passed

N/A

0.863135s

devi

Passed

N/A

1.319086s

loop

Passed

N/A

0.929383s

loop2

Passed

N/A

0.945473s

min

Failed

atf-check failed; see the output of the test for details

1.172297s

no_pseudo

Passed

N/A

0.929752s

no_select

Passed

N/A

0.990374s

no_undefined_opt

Passed

N/A

0.916773s

postponed_orphan

Passed

N/A

0.958356s

pseudo_parent

Passed

N/A

0.896844s

select

Passed

N/A

1.086790s

shadow_instance

Passed

N/A

0.920397s

undefined_opt

Passed

N/A

0.955481s

usr.bin/cut/t_cut

6.683744s

basic

Passed

N/A

1.146173s

dflag

Passed

N/A

1.100736s

dsflag

Passed

N/A

1.179386s

latin1

Passed

N/A

0.895308s

sflag

Passed

N/A

1.084002s

utf8

Passed

N/A

1.022712s

usr.bin/diff/t_diff

2.455886s

mallocv

Passed

N/A

0.835013s

nomallocv

Passed

N/A

0.777614s

same

Passed

N/A

0.770949s

usr.bin/dirname/t_dirname

2.414806s

basic

Passed

N/A

2.382977s

usr.bin/find/t_find

2.684779s

emptyperm

Passed

N/A

1.025911s

exit

Passed

N/A

0.798579s

exit_status

Passed

N/A

0.796750s

usr.bin/gdb/t_regress

14.345618s

pie

Passed

N/A

5.847286s

threads

Passed

N/A

8.391971s

usr.bin/grep/t_grep

19.726402s

basic

Passed

N/A

1.102563s

begin_end

Passed

N/A

0.945918s

binary

Passed

N/A

0.807462s

context

Passed

N/A

2.181446s

context2

Passed

N/A

1.927375s

egrep

Passed

N/A

1.123922s

file_exp

Passed

N/A

1.385074s

ignore_case

Passed

N/A

1.150626s

invert

Passed

N/A

1.150286s

negative

Passed

N/A

1.137660s

nonexistent

Passed

N/A

1.096634s

recurse

Failed

Test case exited normally but failed to create the results file: Failed to open /tmp/atf-run.Pr8qtz/tcr

0.773927s

recurse_symlink

Passed

N/A

1.327777s

whole_line

Passed

N/A

1.180173s

word_regexps

Passed

N/A

1.194410s

zgrep

Failed

Test case exited normally but failed to create the results file: Failed to open /tmp/atf-run.Pr8qtz/tcr

0.681628s

usr.bin/gzip/t_gzip

28.530149s

concatenated

Passed

N/A

1.388164s

crcerror

Passed

N/A

1.262958s

good

Passed

N/A

1.290803s

pipe

Passed

N/A

23.612926s

truncated

Passed

N/A

0.791393s

usr.bin/id/t_groups

3.245583s

correct

Passed

N/A

1.998468s

syntax

Passed

N/A

1.180905s

usr.bin/id/t_id

32.307090s

Gflag

Passed

N/A

4.289176s

default

Passed

N/A

2.803564s

gflag

Passed

N/A

7.432561s

pflag

Passed

N/A

3.280759s

primaries

Passed

N/A

6.368574s

uflag

Passed

N/A

7.957843s

usr.bin/id/t_whoami

2.308496s

correct

Passed

N/A

1.136150s

syntax

Passed

N/A

1.110864s

usr.bin/infocmp/t_terminfo

3.599023s

basic

Passed

N/A

2.530348s

missing

Passed

N/A

1.019613s

usr.bin/jot/t_jot

1.886121s

basic

Passed

N/A

0.745842s

format

Passed

N/A

1.090853s

usr.bin/ld/t_script

43.918357s

multisec

Passed

N/A

3.705542s

order_default

Passed

N/A

11.984749s

order_merge

Failed

atf-check failed; see the output of the test for details

9.145544s

order_reorder

Passed

N/A

9.784389s

order_sort

Passed

N/A

9.019190s

usr.bin/ld/t_section

7.180895s

orphan

Passed

N/A

3.753706s

startstop

Passed

N/A

3.320130s

usr.bin/m4/t_m4

1.290190s

eof

Passed

N/A

1.258055s

usr.bin/make/t_make

225.949972s

comment

Passed

N/A

3.952828s

cond1

Passed

N/A

4.160848s

cond2

Passed

N/A

3.780080s

doterror

Passed

N/A

4.059554s

dotwait

Passed

N/A

29.568672s

error

Passed

N/A

4.009810s

escape

Expected failure

see PR toolchain/49085: atf-check failed; see the output of the test for details

2.580518s

export

Passed

N/A

4.024985s

export_all

Passed

N/A

3.792698s

export_env

Passed

N/A

3.673388s

forloop

Failed

Test case exited normally but failed to create the results file: Failed to open /tmp/atf-run.j6MAIw/tcr

1.685557s

forsubst

Passed

N/A

4.244271s

hash

Passed

N/A

5.513325s

impsrc

Expected failure

see PR toolchain/49085: atf-check failed; see the output of the test for details

4.841547s

misc

Passed

N/A

5.657338s

moderrs

Passed

N/A

4.226757s

modmatch

Passed

N/A

5.378334s

modmisc

Passed

N/A

4.068848s

modorder

Passed

N/A

4.407066s

modts

Passed

N/A

6.405062s

modword

Passed

N/A

14.725255s

order

Passed

N/A

6.393888s

phony_end

Expected failure

see PR toolchain/49085: atf-check failed; see the output of the test for details

7.193844s

posix

Passed

N/A

7.696908s

posix1

Expected failure

see PR toolchain/49085: atf-check failed; see the output of the test for details

13.903766s

qequals

Passed

N/A

6.478677s

suffixes

Expected failure

see PR toolchain/49085: this uses up all memory and then fails

3.361113s

sunshcmd

Passed

N/A

7.163368s

sysv

Passed

N/A

7.154809s

ternary

Passed

N/A

7.893282s

unexport

Passed

N/A

6.467373s

unexport_env

Passed

N/A

6.659112s

varcmd

Passed

N/A

8.674640s

varmisc

Passed

N/A

6.342305s

varshell

Passed

N/A

4.487730s

usr.bin/mkdep/t_mkdep

10.741026s

prefix

Passed

N/A

2.016535s

prefix_and_suffixes

Passed

N/A

2.132657s

suffixes

Passed

N/A

6.502303s

usr.bin/nbperf/t_nbperf

260.394311s

bdz

Failed

atf-check failed; see the output of the test for details

72.085535s

chm

Passed

N/A

120.966647s

chm3

Failed

atf-check failed; see the output of the test for details

67.203838s

usr.bin/netpgpverify/t_netpgpverify

14.304651s

netpgpverify_testset_1_rsa_signatures

Failed

Test case exited normally but failed to create the results file: Failed to open /tmp/atf-run.XJUL5Q/tcr

3.242216s

netpgpverify_testset_2_dsa_signatures

Passed

N/A

10.946352s

usr.bin/pr/t_basic

0.842754s

basic

Passed

N/A

0.803878s

usr.bin/rump_server/t_disk

17.796818s

data

Passed

N/A

2.772362s

notrunc

Passed

N/A

2.082502s

offset

Passed

N/A

1.959539s

size

Passed

N/A

1.982041s

type_blk

Passed

N/A

2.164312s

type_blk_default

Passed

N/A

2.189541s

type_chr

Passed

N/A

2.142502s

type_reg

Passed

N/A

2.210961s

usr.bin/shmif_dumpbus/t_basic

5.839585s

contents

Passed

N/A

1.863006s

header

Passed

N/A

1.303030s

pcap

Passed

N/A

2.535567s

usr.bin/sdiff/t_sdiff

29.059189s

dot

Passed

N/A

1.812207s

flags

Passed

N/A

2.011329s

iflags

Passed

N/A

4.434586s

merge

Passed

N/A

11.463964s

oneline

Passed

N/A

1.456898s

same

Passed

N/A

1.235763s

short

Passed

N/A

1.315148s

stdin

Passed

N/A

1.834706s

tabends

Passed

N/A

1.924519s

tabs

Passed

N/A

1.252749s

usr.bin/sed/t_sed

11.384303s

c2048

Passed

N/A

1.037309s

emptybackref

Expected failure

PR bin/28126: atf-check failed; see the output of the test for details

1.507855s

longlines

Passed

N/A

1.558936s

preserve_leading_ws_ia

Passed

N/A

0.937555s

rangeselection

Passed

N/A

6.129848s

usr.bin/sort/t_sort

74.252763s

any_char

Passed

N/A

2.121194s

basic

Passed

N/A

1.039419s

bflag

Failed

Test program received signal 11 (core dumped)

0.092912s

cflag

Passed

N/A

1.044099s

empty_file

Passed

N/A

1.682298s

end_of_options

Passed

N/A

1.887663s

kflag_alpha

Passed

N/A

6.478050s

kflag_limits

Passed

N/A

1.418656s

kflag_many_fields

Passed

N/A

1.461464s

kflag_no_end

Passed

N/A

1.370414s

kflag_nonmonotone

Passed

N/A

1.369055s

kflag_one_field

Passed

N/A

1.404066s

kflag_outofbounds

Passed

N/A

1.348539s

kflag_two_fields

Passed

N/A

1.425805s

long_file

Failed

atf-check failed; see the output of the test for details

4.555582s

long_records

Passed

N/A

1.945398s

mflag

Passed

N/A

1.273450s

mflag_uflag

Passed

N/A

1.364979s

mflag_uflag_first

Passed

N/A

1.662546s

missing_newline

Passed

N/A

1.335129s

nflag

Passed

N/A

1.422126s

nflag_rflag

Passed

N/A

1.135424s

null_bytes

Passed

N/A

1.117733s

oflag

Passed

N/A

1.693529s

oflag_displaced

Passed

N/A

1.128840s

plus_as_path

Passed

N/A

1.316425s

plus_bad_tempfile

Passed

N/A

1.126418s

plus_no_end

Passed

N/A

1.131932s

plus_nonmonotone

Passed

N/A

1.298631s

plus_one

Passed

N/A

1.428470s

plus_one_minus_two

Passed

N/A

1.305690s

plus_rflag_invalid

Passed

N/A

1.298491s

plus_tflag

Passed

N/A

4.872846s

plus_zero

Passed

N/A

1.302025s

rflag

Passed

N/A

1.354603s

sflag

Passed

N/A

1.483007s

sflag_many_files

Passed

N/A

1.502563s

tflag

Passed

N/A

2.111318s

tflag_alphabetic

Failed

Test program received signal 11 (core dumped)

0.350553s

tflag_char_pos

Passed

N/A

2.311295s

tflag_whitespace

Passed

N/A

2.954263s

uflag

Passed

N/A

1.258762s

uflag_rflag

Passed

N/A

1.396289s

usr.bin/tmux/t_tmux

5.564192s

stdin

Passed

N/A

5.486281s

usr.bin/tr/t_basic

37.770286s

csubst

Passed

N/A

2.267316s

dopt

Passed

N/A

16.861264s

dsopt

Passed

N/A

6.288243s

sopt

Passed

N/A

6.186161s

subst

Passed

N/A

5.996742s

usr.bin/unifdef/t_basic

1.709645s

basic

Passed

N/A

0.817269s

lastline

Passed

N/A

0.850134s

usr.bin/vmstat/t_vmstat

1.832603s

default

Passed

N/A

0.760454s

opt_s

Passed

N/A

1.005882s

usr.bin/xlint/lint1/t_integration

0.026625s

usr.sbin/mtree/t_mtree

0.020277s

usr.sbin/tcpdump/t_tcpdump

9.493830s

promiscuous

Passed

N/A

9.443105s

usr.sbin/traceroute/t_traceroute

37.153264s

basic

Passed

N/A

17.423504s

basic_icmp

Passed

N/A

19.551973s

usr.sbin/useradd/t_useradd

2.712543s

longname

Expected failure

PR bin/39546: atf-check failed; see the output of the test for details

2.679433s

fs/ffs/t_fifos

1.502110s

fifos

Passed

N/A

1.446160s

fs/ffs/t_snapshot

13.854805s

snapshot

Passed

N/A

6.770801s

snapshotstress

Passed

N/A

7.034412s

fs/ffs/t_snapshot_log

16.957311s

snapshot

Passed

N/A

6.464771s

snapshotstress

Passed

N/A

10.420054s

fs/ffs/t_snapshot_v2

11.757963s

snapshot

Passed

N/A

4.709638s

snapshotstress

Passed

N/A

7.000481s

fs/ffs/t_mount

3.112837s

48Kimage

Expected failure

PR kern/43573: mount failed: Invalid argument

1.016231s

fsbsizeovermaxbsize

Passed

N/A

0.967276s

fsbsizeovermaxphys

Passed

N/A

0.965394s

fs/ffs/t_quota2_1

69.999731s

quota_1000_O1_be

Passed

N/A

15.152779s

quota_1000_O1_le

Passed

N/A

13.193696s

quota_1000_O2_be

Passed

N/A

15.739397s

quota_1000_O2_le

Passed

N/A

14.546859s

quota_40_O1_be

Passed

N/A

1.805468s

quota_40_O1_le

Passed

N/A

2.036717s

quota_40_O1_log

Passed

N/A

1.747353s

quota_40_O2_be

Passed

N/A

1.757226s

quota_40_O2_le

Passed

N/A

1.945293s

quota_40_O2_log

Passed

N/A

1.623783s

fs/ffs/t_quota2_remount

1.999715s

quota_10_O1_be

Passed

N/A

0.893657s

quota_10_O1_le

Passed

N/A

0.968492s

fs/ffs/t_getquota

84.824618s

get_be_1_both

Passed

N/A

6.051971s

get_be_1_group

Passed

N/A

5.804998s

get_be_1_user

Passed

N/A

6.928885s

get_be_2_both

Failed

atf-check failed; see the output of the test for details

5.895757s

get_be_2_group

Passed

N/A

8.892770s

get_be_2_user

Passed

N/A

6.248002s

get_le_1_both

Passed

N/A

6.970871s

get_le_1_group

Passed

N/A

7.590111s

get_le_1_user

Passed

N/A

7.446188s

get_le_2_both

Passed

N/A

8.474701s

get_le_2_group

Failed

atf-check failed; see the output of the test for details

4.871858s

get_le_2_user

Passed

N/A

8.797618s

fs/ffs/t_setquota

403.274861s

set_be_1_both

Passed

N/A

7.388088s

set_be_1_group

Passed

N/A

9.130351s

set_be_1_user

Passed

N/A

11.734099s

set_be_2_both

Passed

N/A

11.403194s

set_be_2_group

Passed

N/A

12.236755s

set_be_2_user

Passed

N/A

12.152876s

set_default_be_1_both

Passed

N/A

9.059847s

set_default_be_1_group

Passed

N/A

8.361606s

set_default_be_1_user

Passed

N/A

8.485128s

set_default_be_2_both

Passed

N/A

8.961663s

set_default_be_2_group

Passed

N/A

9.068544s

set_default_be_2_user

Passed

N/A

7.387402s

set_default_le_1_both

Passed

N/A

9.967580s

set_default_le_1_group

Passed

N/A

9.523666s

set_default_le_1_user

Passed

N/A

9.503110s

set_default_le_2_both

Passed

N/A

9.650591s

set_default_le_2_group

Passed

N/A

10.018118s

set_default_le_2_user

Passed

N/A

10.054335s

set_le_1_both

Passed

N/A

13.640183s

set_le_1_group

Passed

N/A

12.842394s

set_le_1_user

Passed

N/A

12.544433s

set_le_2_both

Passed

N/A

12.280524s

set_le_2_group

Passed

N/A

12.286897s

set_le_2_user

Passed

N/A

12.441785s

set_new_be_1_both

Passed

N/A

10.165188s

set_new_be_1_both_log

Passed

N/A

10.454979s

set_new_be_1_group

Failed

Test case exited normally but failed to create the results file: Failed to open /tmp/atf-run.64ZmXT/tcr

2.577311s

set_new_be_1_user

Passed

N/A

9.752095s

set_new_be_2_both

Passed

N/A

9.357822s

set_new_be_2_both_log

Passed

N/A

9.535534s

set_new_be_2_group

Passed

N/A

8.854427s

set_new_be_2_user

Passed

N/A

9.707770s

set_new_le_1_both

Passed

N/A

9.787439s

set_new_le_1_both_log

Passed

N/A

10.741314s

set_new_le_1_group

Passed

N/A

10.060694s

set_new_le_1_user

Passed

N/A

9.607432s

set_new_le_2_both

Passed

N/A

9.611021s

set_new_le_2_both_log

Passed

N/A

10.686784s

set_new_le_2_group

Passed

N/A

9.644475s

set_new_le_2_user

Passed

N/A

9.939628s

fs/ffs/t_quotalimit

249.087986s

herit_defq_le_1_group

Passed

N/A

13.417465s

herit_defq_le_1_group_log

Passed

N/A

13.201477s

herit_defq_le_1_user

Failed

atf-check failed; see the output of the test for details

12.452529s

herit_defq_le_1_user_log

Passed

N/A

14.267428s

herit_idefq_le_1_group_log

Passed

N/A

14.076849s

herit_idefq_le_1_user_log

Passed

N/A

14.193307s

inolimit_le_1_group

Passed

N/A

13.071745s

inolimit_le_1_group_log

Passed

N/A

12.005639s

inolimit_le_1_user

Passed

N/A

12.398657s

inolimit_le_1_user_log

Passed

N/A

11.770957s

limit_le_1_group

Passed

N/A

11.352868s

limit_le_1_group_log

Passed

N/A

11.966527s

limit_le_1_user

Passed

N/A

12.552858s

limit_le_1_user_log

Passed

N/A

12.803789s

sinolimit_le_1_group

Passed

N/A

17.229477s

sinolimit_le_1_user

Passed

N/A

17.189414s

slimit_le_1_group

Passed

N/A

16.769703s

slimit_le_1_user

Passed

N/A

16.998101s

fs/ffs/t_clearquota

183.339931s

clear_be_1_both

Passed

N/A

12.872125s

clear_be_1_both_log

Passed

N/A

14.761955s

clear_be_1_group

Passed

N/A

10.672758s

clear_be_1_user

Passed

N/A

11.295173s

clear_be_2_both

Passed

N/A

13.133533s

clear_be_2_both_log

Passed

N/A

13.929390s

clear_be_2_group

Passed

N/A

11.039702s

clear_be_2_user

Passed

N/A

11.295793s

clear_le_1_both

Passed

N/A

13.775323s

clear_le_1_both_log

Passed

N/A

13.781143s

clear_le_1_group

Passed

N/A

11.398856s

clear_le_1_user

Passed

N/A

12.131106s

clear_le_2_both

Passed

N/A

12.694340s

clear_le_2_both_log

Passed

N/A

7.695217s

clear_le_2_group

Passed

N/A

5.689756s

clear_le_2_user

Passed

N/A

6.166792s

fs/ffs/t_miscquota

236.601046s

default_deny_user

Passed

N/A

9.928466s

default_deny_user_big

Passed

N/A

84.616436s

log_unlink

Passed

N/A

7.504990s

log_unlink_remount

Passed

N/A

6.929474s

npsnapshot_unconf_user

Passed

N/A

15.100840s

npsnapshot_user

Passed

N/A

12.417629s

psnapshot_unconf_user

Failed

atf-check failed; see the output of the test for details

14.418679s

psnapshot_user

Passed

N/A

9.939962s

walk_list_user

Passed

N/A

75.198360s

fs/fifofs/t_fifo

1.561830s

parent_child

Passed

N/A

1.539992s

fs/hfs/t_pathconvert

1.347826s

colonslash

Passed

N/A

1.249078s

fs/kernfs/t_basic

1.084340s

getdents

Passed

N/A

0.479677s

hostname

Passed

N/A

0.500470s

fs/lfs/t_pr

3.621855s

mknod

Passed

N/A

3.471700s

fs/msdosfs/t_snapshot

14.270599s

snapshot

Passed

N/A

6.836943s

snapshotstress

Passed

N/A

7.263839s

fs/nfs/t_mountd

9.716052s

mountdhup

Expected failure

PR kern/5844: op failed with EACCES

9.556403s

fs/nfs/t_rquotad

254.017516s

get_nfs_be_1_both

Passed

N/A

46.404932s

get_nfs_be_1_group

Passed

N/A

43.598881s

get_nfs_be_1_user

Passed

N/A

40.939517s

get_nfs_le_1_both

Passed

N/A

44.280786s

get_nfs_le_1_group

Passed

N/A

39.640479s

get_nfs_le_1_user

Passed

N/A

38.706235s

fs/nullfs/t_basic

1.531888s

basic

Passed

N/A

0.697451s

twistymount

Passed

N/A

0.695936s

fs/psshfs/t_psshfs

46.797117s

inode_nos

Passed

N/A

20.060232s

ls

Failed

atf-check failed; see the output of the test for details

7.357309s

pwd

Passed

N/A

19.057856s

fs/ptyfs/t_ptyfs

0.990575s

basic

Passed

N/A

0.871028s

fs/ptyfs/t_nullpts

0.941956s

nullrevoke

Passed

N/A

0.863571s

fs/puffs/t_basic

15.753820s

inactive_basic

Passed

N/A

1.466008s

inactive_reclaim

Passed

N/A

1.620229s

mount

Passed

N/A

1.407010s

reclaim_hardlink

Passed

N/A

1.768086s

root_chrdev

Passed

N/A

1.586787s

root_fifo

Passed

N/A

1.578976s

root_lnk

Passed

N/A

1.209173s

root_reg

Passed

N/A

1.419954s

signals

Passed

N/A

1.482394s

unlink_accessible

Passed

N/A

1.505068s

fs/puffs/t_fuzz

14.983484s

mountfuzz0

Passed

N/A

1.510926s

mountfuzz1

Passed

N/A

1.468744s

mountfuzz2

Passed

N/A

1.428044s

mountfuzz3

Passed

N/A

1.509601s

mountfuzz4

Passed

N/A

1.212805s

mountfuzz5

Passed

N/A

1.184860s

mountfuzz6

Passed

N/A

1.101368s

mountfuzz7

Passed

N/A

1.201974s

mountfuzz8

Passed

N/A

3.976584s

fs/puffs/t_io

1.629089s

nocache

Passed

N/A

1.542548s

fs/tmpfs/t_renamerace

8.405302s

renamerace2

Passed

N/A

8.320626s

fs/tmpfs/t_create

16.208479s

attrs

Passed

N/A

8.543240s

create

Passed

N/A

4.035677s

kqueue

Passed

N/A

3.477157s

fs/tmpfs/t_devices

5.098640s

basic

Passed

N/A

5.027014s

fs/tmpfs/t_dots

7.439209s

nesteddir

Passed

N/A

3.679850s

topdir

Passed

N/A

3.659111s

fs/tmpfs/t_exec

3.474333s

basic

Passed

N/A

3.397662s

fs/tmpfs/t_link

16.224365s

basic

Passed

N/A

5.444588s

kqueue

Passed

N/A

5.437003s

subdirs

Passed

N/A

5.233580s

fs/tmpfs/t_mkdir

119.519737s

attrs

Passed

N/A

6.028317s

kqueue

Passed

N/A

4.160107s

many

Passed

N/A

101.719676s

nested

Passed

N/A

3.450725s

single

Passed

N/A

3.831173s

fs/tmpfs/t_mknod

0.068959s

fs/tmpfs/t_mount

17.330224s

attrs

Passed

N/A

2.860967s

large

Passed

N/A

3.516685s

mntpt

Passed

N/A

2.837173s

negative

Passed

N/A

2.578164s

options

Passed

N/A

2.910085s

plain

Passed

N/A

2.395919s

fs/tmpfs/t_pipes

2.947199s

basic

Passed

N/A

2.877805s

fs/tmpfs/t_read_write

8.213930s

basic

Passed

N/A

3.545320s

kqueue

Passed

N/A

4.578847s

fs/tmpfs/t_readdir

43.720405s

caching

Passed

N/A

4.224223s

dots

Passed

N/A

3.753832s

many

Passed

N/A

29.680517s

types

Passed

N/A

5.812616s

fs/tmpfs/t_remove

17.394874s

dot

Passed

N/A

3.640475s

kqueue

Passed

N/A

4.337469s

single

Passed

N/A

4.255125s

uchg

Passed

N/A

4.908258s

fs/tmpfs/t_rename

56.124810s

basic

Passed

N/A

4.236384s

crossdev

Passed

N/A

4.282050s

dir_to_emptydir

Passed

N/A

5.184097s

dir_to_file

Passed

N/A

5.136081s

dir_to_fulldir

Passed

N/A

6.775758s

dotdot

Passed

N/A

10.321898s

dots

Passed

N/A

3.786979s

file_to_dir

Passed

N/A

5.021576s

kqueue

Passed

N/A

10.768594s

fs/tmpfs/t_rmdir

30.979128s

curdir

Passed

N/A

3.561235s

dots

Passed

N/A

3.244535s

kqueue

Passed

N/A

4.134756s

links

Passed

N/A

4.586175s

mntpt

Passed

N/A

2.986217s

nested

Passed

N/A

3.605517s

non_empty

Passed

N/A

4.236289s

non_existent

Passed

N/A

2.928990s

single

Failed

atf-check failed; see the output of the test for details

1.299170s

fs/tmpfs/t_setattr

37.530888s

chgrp

Passed

N/A

3.476819s

chgrp_kqueue

Passed

N/A

4.035013s

chmod

Passed

N/A

3.315156s

chmod_kqueue

Passed

N/A

3.754784s

chown

Passed

N/A

3.806735s

chown_kqueue

Passed

N/A

3.890654s

chowngrp

Passed

N/A

3.619773s

chowngrp_kqueue

Passed

N/A

3.551370s

chtimes

Passed

N/A

3.911113s

chtimes_kqueue

Passed

N/A

3.663776s

fs/tmpfs/t_sizes

17.308087s

big

Passed

N/A

5.199914s

overflow

Passed

N/A

5.569778s

overwrite

Passed

N/A

3.502745s

small

Passed

N/A

2.790261s

fs/tmpfs/t_sockets

4.444256s

basic

Passed

N/A

4.384506s

fs/tmpfs/t_statvfs

2.604910s

values

Passed

N/A

2.497839s

fs/tmpfs/t_symlink

15.716876s

dir

Passed

N/A

4.536224s

exec

Passed

N/A

3.642389s

file

Passed

N/A

3.550194s

kqueue

Passed

N/A

3.814552s

fs/tmpfs/t_times

24.729174s

empty

Passed

N/A

8.010319s

link

Passed

N/A

5.377210s

non_empty

Passed

N/A

5.350724s

rename

Passed

N/A

5.830116s

fs/tmpfs/t_trail_slash

4.375810s

main

Passed

N/A

4.322618s

fs/tmpfs/t_truncate

3.233458s

basic

Passed

N/A

3.175587s

fs/tmpfs/t_vnd

30.380620s

basic

Passed

N/A

30.313784s

fs/tmpfs/t_vnode_leak

0.856221s

main

Failed

Test program received signal 11 (core dumped)

0.793596s

fs/umapfs/t_basic

0.459026s

basic

Passed

N/A

0.428296s

fs/union/t_pr

1.320923s

devnull1

Passed

N/A

0.404214s

devnull2

Passed

N/A

0.387856s

multilayer

Passed

N/A

0.425948s

fs/vfs/t_full

92.292552s

ext2fs_fillfs

Passed

N/A

5.456534s

ffs_fillfs

Passed

N/A

2.979607s

ffslog_fillfs

Passed

N/A

4.113963s

lfs_fillfs

Passed

N/A

9.640659s

msdosfs_fillfs

Passed

N/A

3.945639s

nfs_fillfs

Passed

N/A

16.263621s

p2k_ffs_fillfs

Failed

newfs failed: No such file or directory

2.023287s

puffs_fillfs

Skipped

fs does not support explicit block allocation (GOP_ALLOC)

1.363142s

rumpfs_fillfs

Skipped

fs does not support explicit block allocation (GOP_ALLOC)

1.200952s

sysvbfs_fillfs

Passed

N/A

8.585190s

tmpfs_fillfs

Passed

N/A

1.820991s

udf_fillfs

Passed

N/A

4.757239s

v7fs_fillfs

Passed

N/A

29.046527s

fs/vfs/t_io

301.268705s

ext2fs_extendfile

Passed

N/A

1.713910s

ext2fs_extendfile_append

Passed

N/A

1.439175s

ext2fs_holywrite

Passed

N/A

1.387391s

ext2fs_overwrite512

Passed

N/A

1.396059s

ext2fs_overwrite64k

Passed

N/A

1.285795s

ext2fs_overwrite_trunc

Passed

N/A

1.382075s

ext2fs_read_after_unlink

Passed

N/A

1.448216s

ext2fs_read_fault

Passed

N/A

1.420141s

ext2fs_shrinkfile

Passed

N/A

1.364265s

ext2fs_wrrd_after_unlink

Passed

N/A

1.399637s

ffs_extendfile

Passed

N/A

1.603494s

ffs_extendfile_append

Passed

N/A

1.536924s

ffs_holywrite

Passed

N/A

1.583499s

ffs_overwrite512

Passed

N/A

1.528764s

ffs_overwrite64k

Passed

N/A

1.585338s

ffs_overwrite_trunc

Passed

N/A

1.608652s

ffs_read_after_unlink

Passed

N/A

1.567975s

ffs_read_fault

Passed

N/A

1.670307s

ffs_shrinkfile

Passed

N/A

1.576053s

ffs_wrrd_after_unlink

Failed

Test program received signal 11 (core dumped)

1.168549s

ffslog_extendfile

Passed

N/A

1.871365s

ffslog_extendfile_append

Passed

N/A

1.914338s

ffslog_holywrite

Passed

N/A

1.746396s

ffslog_overwrite512

Passed

N/A

1.880755s

ffslog_overwrite64k

Passed

N/A

1.820157s

ffslog_overwrite_trunc

Passed

N/A

1.768183s

ffslog_read_after_unlink

Passed

N/A

1.833538s

ffslog_read_fault

Passed

N/A

1.732277s

ffslog_shrinkfile

Passed

N/A

1.687320s

ffslog_wrrd_after_unlink

Passed

N/A

1.757060s

lfs_extendfile

Passed

N/A

3.328417s

lfs_extendfile_append

Passed

N/A

3.314057s

lfs_holywrite

Passed

N/A

3.624583s

lfs_overwrite512

Passed

N/A

3.329697s

lfs_overwrite64k

Passed

N/A

3.477859s

lfs_overwrite_trunc

Passed

N/A

4.857373s

lfs_read_after_unlink

Passed

N/A

5.363826s

lfs_read_fault

Passed

N/A

5.685642s

lfs_shrinkfile

Passed

N/A

5.826151s

lfs_wrrd_after_unlink

Passed

N/A

5.941350s

msdosfs_extendfile

Passed

N/A

2.340355s

msdosfs_extendfile_append

Passed

N/A

1.475872s

msdosfs_holywrite

Failed

newfs failed: Undefined error: 0

0.409344s

msdosfs_overwrite512

Passed

N/A

1.409354s

msdosfs_overwrite64k

Passed

N/A

1.381106s

msdosfs_overwrite_trunc

Passed

N/A

1.360487s

msdosfs_read_after_unlink

Passed

N/A

1.375464s

msdosfs_read_fault

Passed

N/A

1.350779s

msdosfs_shrinkfile

Passed

N/A

1.247615s

msdosfs_wrrd_after_unlink

Passed

N/A

1.446447s

nfs_extendfile

Passed

N/A

4.854291s

nfs_extendfile_append

Passed

N/A

4.859505s

nfs_holywrite

Passed

N/A

4.792685s

nfs_overwrite512

Passed

N/A

4.880460s

nfs_overwrite64k

Passed

N/A

4.815522s

nfs_overwrite_trunc

Passed

N/A

5.263269s

nfs_read_after_unlink

Passed

N/A

4.928397s

nfs_read_fault

Passed

N/A

4.651913s

nfs_shrinkfile

Passed

N/A

4.809049s

nfs_wrrd_after_unlink

Passed

N/A

4.836865s

p2k_ffs_extendfile

Passed

N/A

2.592778s

p2k_ffs_extendfile_append

Passed

N/A

2.718570s

p2k_ffs_holywrite

Passed

N/A

2.712330s

p2k_ffs_overwrite512

Passed

N/A

2.988188s

p2k_ffs_overwrite64k

Passed

N/A

2.728796s

p2k_ffs_overwrite_trunc

Passed

N/A

2.774201s

p2k_ffs_read_after_unlink

Passed

N/A

3.087868s

p2k_ffs_read_fault

Passed

N/A

2.593335s

p2k_ffs_shrinkfile

Passed

N/A

2.664008s

p2k_ffs_wrrd_after_unlink

Passed

N/A

2.800771s

puffs_extendfile

Passed

N/A

1.568863s

puffs_extendfile_append

Passed

N/A

1.572712s

puffs_holywrite

Passed

N/A

1.549782s

puffs_overwrite512

Passed

N/A

1.526430s

puffs_overwrite64k

Passed

N/A

1.639289s

puffs_overwrite_trunc

Failed

child died

0.436277s

puffs_read_after_unlink

Passed

N/A

1.551508s

puffs_read_fault

Passed

N/A

1.550080s

puffs_shrinkfile

Passed

N/A

1.522345s

puffs_wrrd_after_unlink

Passed

N/A

1.601033s

rumpfs_extendfile

Passed

N/A

1.169573s

rumpfs_extendfile_append

Passed

N/A

1.149022s

rumpfs_holywrite

Passed

N/A

1.212457s

rumpfs_overwrite512

Passed

N/A

1.145909s

rumpfs_overwrite64k

Passed

N/A

1.235901s

rumpfs_overwrite_trunc

Passed

N/A

1.257949s

rumpfs_read_after_unlink

Passed

N/A

1.157253s

rumpfs_read_fault

Passed

N/A

1.190158s

rumpfs_shrinkfile

Passed

N/A

1.110459s

rumpfs_wrrd_after_unlink

Passed

N/A

1.135098s

sysvbfs_extendfile

Passed

N/A

1.408806s

sysvbfs_extendfile_append

Passed

N/A

1.319079s

sysvbfs_holywrite

Passed

N/A

1.319369s

sysvbfs_overwrite512

Passed

N/A

1.431899s

sysvbfs_overwrite64k

Passed

N/A

1.432074s

sysvbfs_overwrite_trunc

Passed

N/A

1.422935s

sysvbfs_read_after_unlink

Passed

N/A

1.456472s

sysvbfs_read_fault

Passed

N/A

1.833170s

sysvbfs_shrinkfile

Passed

N/A

1.674440s

sysvbfs_wrrd_after_unlink

Passed

N/A

1.580963s

tmpfs_extendfile

Passed

N/A

1.419055s

tmpfs_extendfile_append

Passed

N/A

1.711914s

tmpfs_holywrite

Passed

N/A

1.656481s

tmpfs_overwrite512

Passed

N/A

1.200429s

tmpfs_overwrite64k

Passed

N/A

1.177607s

tmpfs_overwrite_trunc

Passed

N/A

1.216140s

tmpfs_read_after_unlink

Passed

N/A

1.190782s

tmpfs_read_fault

Passed

N/A

1.350653s

tmpfs_shrinkfile

Passed

N/A

1.476600s

tmpfs_wrrd_after_unlink

Passed

N/A

1.388739s

udf_extendfile

Passed

N/A

2.307438s

udf_extendfile_append

Passed

N/A

2.703742s

udf_holywrite

Passed

N/A

2.006636s

udf_overwrite512

Passed

N/A

1.410823s

udf_overwrite64k

Passed

N/A

1.471523s

udf_overwrite_trunc

Passed

N/A

2.583007s

udf_read_after_unlink

Passed

N/A

3.382662s

udf_read_fault

Passed

N/A

2.963278s

udf_shrinkfile

Passed

N/A

2.879373s

udf_wrrd_after_unlink

Passed

N/A

3.050512s

v7fs_extendfile

Passed

N/A

2.632335s

v7fs_extendfile_append

Passed

N/A

2.971448s

v7fs_holywrite

Passed

N/A

2.699999s

v7fs_overwrite512

Passed

N/A

2.834910s

v7fs_overwrite64k

Passed

N/A

3.394735s

v7fs_overwrite_trunc

Passed

N/A

3.497585s

v7fs_read_after_unlink

Passed

N/A

2.852383s

v7fs_read_fault

Passed

N/A

2.759785s

v7fs_shrinkfile

Passed

N/A

2.780559s

v7fs_wrrd_after_unlink

Passed

N/A

5.353038s

fs/vfs/t_renamerace

233.277561s

ext2fs_renamerace

Passed

N/A

6.570088s

ext2fs_renamerace_dirs

Passed

N/A

7.431517s

ffs_renamerace

Passed

N/A

6.649538s

ffs_renamerace_dirs

Passed

N/A

6.694928s

ffslog_renamerace

Passed

N/A

11.638608s

ffslog_renamerace_dirs

Passed

N/A

10.698761s

lfs_renamerace

Passed

N/A

17.805794s

lfs_renamerace_dirs

Passed

N/A

17.178785s

msdosfs_renamerace

Expected failure

PR kern/43626: unmount failed: Device busy

6.658161s

msdosfs_renamerace_dirs

Expected signal

PR kern/43626

10.936945s

nfs_renamerace

Passed

N/A

12.058613s

nfs_renamerace_dirs

Passed

N/A

10.438710s

p2k_ffs_renamerace

Passed

N/A

9.515588s

p2k_ffs_renamerace_dirs

Passed

N/A

8.639636s

puffs_renamerace

Passed

N/A

11.540205s

puffs_renamerace_dirs

Passed

N/A

11.545564s

rumpfs_renamerace

Skipped

rename not supported by file system

1.196496s

rumpfs_renamerace_dirs

Skipped

rename not supported by file system

0.999123s

sysvbfs_renamerace

Skipped

filesystem has not enough inodes

1.291270s

sysvbfs_renamerace_dirs

Skipped

directories not supported by file system

1.204106s

tmpfs_renamerace

Passed

N/A

11.121252s

tmpfs_renamerace_dirs

Passed

N/A

11.237744s

udf_renamerace

Expected failure

PR kern/49046: race did not trigger this time

11.594474s

udf_renamerace_dirs

Passed

N/A

12.114217s

v7fs_renamerace

Passed

N/A

7.548441s

v7fs_renamerace_dirs

Passed

N/A

7.507612s

fs/vfs/t_ro

194.863615s

ext2fs_attrs

Passed

N/A

1.451134s

ext2fs_create

Passed

N/A

1.485318s

ext2fs_createdir

Passed

N/A

1.329115s

ext2fs_createfifo

Passed

N/A

1.310726s

ext2fs_createlink

Passed

N/A

1.412427s

ext2fs_createsymlink

Passed

N/A

1.441408s

ext2fs_fileio

Passed

N/A

1.357831s

ext2fs_rmfile

Passed

N/A

1.257113s

ffs_attrs

Passed

N/A

1.605835s

ffs_create

Passed

N/A

1.893016s

ffs_createdir

Passed

N/A

1.631051s

ffs_createfifo

Passed

N/A

1.616879s

ffs_createlink

Passed

N/A

1.699415s

ffs_createsymlink

Passed

N/A

1.580054s

ffs_fileio

Passed

N/A

1.697467s

ffs_rmfile

Passed

N/A

1.816492s

ffslog_attrs

Passed

N/A

1.647924s

ffslog_create

Passed

N/A

1.793708s

ffslog_createdir

Passed

N/A

1.777541s

ffslog_createfifo

Passed

N/A

1.733781s

ffslog_createlink

Passed

N/A

1.646361s

ffslog_createsymlink

Passed

N/A

1.655503s

ffslog_fileio

Passed

N/A

1.754233s

ffslog_rmfile

Passed

N/A

1.576843s

msdosfs_attrs

Passed

N/A

1.509056s

msdosfs_create

Passed

N/A

1.608657s

msdosfs_createdir

Passed

N/A

1.534086s

msdosfs_createfifo

Passed

N/A

1.917084s

msdosfs_createlink

Passed

N/A

2.332367s

msdosfs_createsymlink

Passed

N/A

2.244642s

msdosfs_fileio

Passed

N/A

1.749131s

msdosfs_rmfile

Passed

N/A

1.332041s

nfs_attrs

Passed

N/A

5.465054s

nfs_create

Passed

N/A

5.107883s

nfs_createdir

Passed

N/A

4.938687s

nfs_createfifo

Passed

N/A

7.659931s

nfs_createlink

Passed

N/A

7.978613s

nfs_createsymlink

Passed

N/A

7.535699s

nfs_fileio

Passed

N/A

7.892548s

nfs_rmfile

Passed

N/A

5.122682s

nfsro_attrs

Passed

N/A

5.435391s

nfsro_create

Passed

N/A

5.996008s

nfsro_createdir

Passed

N/A

6.169674s

nfsro_createfifo

Passed

N/A

6.298322s

nfsro_createlink

Passed

N/A

5.144089s

nfsro_createsymlink

Passed

N/A

4.992284s

nfsro_fileio

Passed

N/A

5.638760s

nfsro_rmfile

Passed

N/A

5.199641s

sysvbfs_attrs

Passed

N/A

1.373408s

sysvbfs_create

Passed

N/A

1.293826s

sysvbfs_createdir

Passed

N/A

1.540923s

sysvbfs_createfifo

Passed

N/A

1.289127s

sysvbfs_createlink

Passed

N/A

1.332949s

sysvbfs_createsymlink

Passed

N/A

1.203462s

sysvbfs_fileio

Passed

N/A

1.376181s

sysvbfs_rmfile

Passed

N/A

1.242806s

udf_attrs

Passed

N/A

2.013761s

udf_create

Passed

N/A

1.452987s

udf_createdir

Passed

N/A

1.492390s

udf_createfifo

Passed

N/A

1.659480s

udf_createlink

Passed

N/A

3.097091s

udf_createsymlink

Passed

N/A

1.521368s

udf_fileio

Passed

N/A

1.971552s

udf_rmfile

Passed

N/A

1.982031s

v7fs_attrs

Passed

N/A

2.412802s

v7fs_create

Passed

N/A

2.267135s

v7fs_createdir

Passed

N/A

1.945518s

v7fs_createfifo

Passed

N/A

2.149296s

v7fs_createlink

Passed

N/A

1.635199s

v7fs_createsymlink

Passed

N/A

1.923879s

v7fs_fileio

Passed

N/A

1.864902s

v7fs_rmfile

Passed

N/A

1.600656s

fs/vfs/t_rmdirrace

215.471185s

ext2fs_race

Passed

N/A

11.590570s

ffs_race

Passed

N/A

12.522789s

ffslog_race

Passed

N/A

21.376242s

lfs_race

Passed

N/A

23.521224s

msdosfs_race

Passed

N/A

11.448537s

nfs_race

Passed

N/A

16.406420s

p2k_ffs_race

Passed

N/A

12.935510s

puffs_race

Passed

N/A

22.152016s

rumpfs_race

Passed

N/A

21.961601s

sysvbfs_race

Skipped

directories not supported by file system

2.170781s

tmpfs_race

Passed

N/A

22.044099s

udf_race

Passed

N/A

23.202602s

v7fs_race

Passed

N/A

13.130834s

fs/vfs/t_union

76.377293s

ext2fs_basic

Skipped

fs does not support VOP_WHITEOUT

2.239267s

ext2fs_whiteout

Skipped

fs does not support VOP_WHITEOUT

3.618653s

ffs_basic

Passed

N/A

2.910146s

ffs_whiteout

Passed

N/A

3.451012s

ffslog_basic

Passed

N/A

2.174068s

ffslog_whiteout

Passed

N/A

3.962810s

lfs_basic

Passed

N/A

5.942868s

lfs_whiteout

Passed

N/A

7.005192s

msdosfs_basic

Skipped

fs does not support VOP_WHITEOUT

2.608736s

msdosfs_whiteout

Skipped

fs does not support VOP_WHITEOUT

2.910195s

nfs_basic

Skipped

fs does not support VOP_WHITEOUT

7.816260s

nfs_whiteout

Failed

child died

0.655495s

p2k_ffs_basic

Skipped

fs does not support VOP_WHITEOUT

5.240951s

p2k_ffs_whiteout

Skipped

fs does not support VOP_WHITEOUT

3.593541s

puffs_basic

Skipped

fs does not support VOP_WHITEOUT

1.342661s

puffs_whiteout

Skipped

fs does not support VOP_WHITEOUT

2.099239s

rumpfs_basic

Passed

N/A

1.523341s

rumpfs_whiteout

Passed

N/A

1.549662s

sysvbfs_basic

Skipped

fs does not support VOP_WHITEOUT

1.340955s

sysvbfs_whiteout

Skipped

fs does not support VOP_WHITEOUT

1.694974s

tmpfs_basic

Passed

N/A

1.198248s

tmpfs_whiteout

Passed

N/A

1.645872s

udf_basic

Skipped

fs does not support VOP_WHITEOUT

1.443014s

udf_whiteout

Skipped

fs does not support VOP_WHITEOUT

1.940590s

v7fs_basic

Skipped

fs does not support VOP_WHITEOUT

1.913443s

v7fs_whiteout

Skipped

fs does not support VOP_WHITEOUT

2.558724s

fs/vfs/t_unpriv

138.149237s

ext2fs_dirperms

Passed

N/A

1.557967s

ext2fs_flags

Passed

N/A

1.829839s

ext2fs_owner

Passed

N/A

1.731965s

ext2fs_times

Passed

N/A

2.046779s

ffs_dirperms

Passed

N/A

2.571949s

ffs_flags

Passed

N/A

2.575725s

ffs_owner

Passed

N/A

2.565505s

ffs_times

Passed

N/A

2.705704s

ffslog_dirperms

Passed

N/A

2.907091s

ffslog_flags

Passed

N/A

2.247610s

ffslog_owner

Passed

N/A

1.545623s

ffslog_times

Passed

N/A

2.061945s

lfs_dirperms

Passed

N/A

3.140920s

lfs_flags

Passed

N/A

3.476712s

lfs_owner

Passed

N/A

3.538311s

lfs_times

Passed

N/A

4.016963s

msdosfs_dirperms

Passed

N/A

1.449929s

msdosfs_flags

Passed

N/A

1.535317s

msdosfs_owner

Skipped

owner not supported by file system

1.244633s

msdosfs_times

Passed

N/A

1.538698s

nfs_dirperms

Passed

N/A

4.675774s

nfs_flags

Skipped

file flags not supported by file system

5.850350s

nfs_owner

Passed

N/A

6.279360s

nfs_times

Passed

N/A

7.444740s

p2k_ffs_dirperms

Passed

N/A

3.972999s

p2k_ffs_flags

Passed

N/A

4.099973s

p2k_ffs_owner

Passed

N/A

3.700730s

p2k_ffs_times

Passed

N/A

3.502698s

puffs_dirperms

Passed

N/A

1.917407s

puffs_flags

Skipped

file flags not supported by file system

2.091174s

puffs_owner

Passed

N/A

2.166773s

puffs_times

Passed

N/A

2.374581s

rumpfs_dirperms

Passed

N/A

1.129272s

rumpfs_flags

Passed

N/A

1.505691s

rumpfs_owner

Passed

N/A

1.609859s

rumpfs_times

Passed

N/A

1.509384s

sysvbfs_dirperms

Skipped

directories not supported by file system

1.720928s

sysvbfs_flags

Skipped

file flags not supported by file system

1.983735s

sysvbfs_owner

Passed

N/A

1.219563s

sysvbfs_times

Passed

N/A

2.004772s

tmpfs_dirperms

Passed

N/A

1.723002s

tmpfs_flags

Passed

N/A

2.044431s

tmpfs_owner

Passed

N/A

1.933746s

tmpfs_times

Passed

N/A

1.811264s

udf_dirperms

Passed

N/A

3.065654s

udf_flags

Skipped

file flags not supported by file system

2.559048s

udf_owner

Passed

N/A

2.278788s

udf_times

Passed

N/A

3.101511s

v7fs_dirperms

Passed

N/A

1.789136s

v7fs_flags

Passed

N/A

2.613419s

v7fs_owner

Passed

N/A

2.427995s

v7fs_times

Passed

N/A

2.217024s

fs/vfs/t_vfsops

204.946206s

ext2fs_tfhinval

Passed

N/A

2.504719s

ext2fs_tfhremove

Passed

N/A

2.250131s

ext2fs_tfilehandle

Passed

N/A

2.334969s

ext2fs_tmount

Passed

N/A

1.887319s

ext2fs_tstatvfs

Failed

Test program received signal 11 (core dumped)

6.253702s

ext2fs_tsync

Passed

N/A

2.753195s

ffs_tfhinval

Passed

N/A

3.138151s

ffs_tfhremove

Passed

N/A

2.791177s

ffs_tfilehandle

Passed

N/A

2.764434s

ffs_tmount

Passed

N/A

2.684210s

ffs_tstatvfs

Passed

N/A

2.771960s

ffs_tsync

Passed

N/A

2.828474s

ffslog_tfhinval

Passed

N/A

1.975023s

ffslog_tfhremove

Passed

N/A

2.059143s

ffslog_tfilehandle

Passed

N/A

2.466017s

ffslog_tmount

Passed

N/A

2.317971s

ffslog_tstatvfs

Passed

N/A

2.108228s

ffslog_tsync

Passed

N/A

1.893858s

lfs_tfhinval

Passed

N/A

3.723860s

lfs_tfhremove

Expected failure

fhopen() for removed file succeeds (PR kern/43745): /tmp/bracket/build/2016.06.15.04.33.52-i386/src/tests/fs/vfs/t_vfsops.c:152: Expected true value in rump_sys_fhopen(fhp, fhsize, O_RDONLY) == -1

4.505979s

lfs_tfilehandle

Passed

N/A

5.209425s

lfs_tmount

Passed

N/A

4.819619s

lfs_tstatvfs

Passed

N/A

3.235312s

lfs_tsync

Passed

N/A

4.233583s

msdosfs_tfhinval

Passed

N/A

1.937613s

msdosfs_tfhremove

Passed

N/A

1.693180s

msdosfs_tfilehandle

Passed

N/A

1.559743s

msdosfs_tmount

Passed

N/A

1.513377s

msdosfs_tstatvfs

Passed

N/A

1.430826s

msdosfs_tsync

Passed

N/A

1.648200s

nfs_tfhinval

Passed

N/A

5.476000s

nfs_tfhremove

Passed

N/A

6.512745s

nfs_tfilehandle

Passed

N/A

6.399058s

nfs_tmount

Passed

N/A

6.274765s

nfs_tstatvfs

Passed

N/A

5.509800s

nfs_tsync

Passed

N/A

7.018464s

p2k_ffs_tfhinval

Passed

N/A

4.065440s

p2k_ffs_tfhremove

Passed

N/A

3.346260s

p2k_ffs_tfilehandle

Passed

N/A

2.694314s

p2k_ffs_tmount

Passed

N/A

2.613266s

p2k_ffs_tstatvfs

Passed

N/A

2.381493s

p2k_ffs_tsync

Passed

N/A

2.766636s

puffs_tfhinval

Passed

N/A

1.556266s

puffs_tfhremove

Passed

N/A

1.485235s

puffs_tfilehandle

Passed

N/A

1.495467s

puffs_tmount

Passed

N/A

1.450891s

puffs_tstatvfs

Passed

N/A

1.563252s

puffs_tsync

Passed

N/A

1.490738s

rumpfs_tfhinval

Skipped

file handles not supported

1.148438s

rumpfs_tfhremove

Skipped

file handles not supported

1.067948s

rumpfs_tfilehandle

Skipped

file handles not supported

1.169534s

rumpfs_tmount

Passed

N/A

1.215459s

rumpfs_tstatvfs

Passed

N/A

1.125134s

rumpfs_tsync

Passed

N/A

1.080551s

sysvbfs_tfhinval

Skipped

file handles not supported

1.626969s

sysvbfs_tfhremove

Skipped

file handles not supported

1.258850s

sysvbfs_tfilehandle

Skipped

file handles not supported

1.420741s

sysvbfs_tmount

Passed

N/A

2.060252s

sysvbfs_tstatvfs

Passed

N/A

2.151748s

sysvbfs_tsync

Passed

N/A

2.301424s

tmpfs_tfhinval

Passed

N/A

2.005736s

tmpfs_tfhremove

Passed

N/A

1.903867s

tmpfs_tfilehandle

Passed

N/A

2.061991s

tmpfs_tmount

Passed

N/A

1.966962s

tmpfs_tstatvfs

Passed

N/A

1.921068s

tmpfs_tsync

Passed

N/A

1.782912s

udf_tfhinval

Skipped

file handles not supported

2.349827s

udf_tfhremove

Skipped

file handles not supported

2.121629s

udf_tfilehandle

Failed

newfs failed: Undefined error: 0

0.598671s

udf_tmount

Passed

N/A

2.403275s

udf_tstatvfs

Passed

N/A

2.225025s

udf_tsync

Passed

N/A

2.109289s

v7fs_tfhinval

Skipped

file handles not supported

2.651642s

v7fs_tfhremove

Skipped

file handles not supported

1.718548s

v7fs_tfilehandle

Skipped

file handles not supported

1.766962s

v7fs_tmount

Passed

N/A

1.943499s

v7fs_tstatvfs

Passed

N/A

2.004041s

v7fs_tsync

Passed

N/A

1.819810s

fs/vfs/t_vnops

1328.454923s

ext2fs_access_simple

Passed

N/A

2.052704s

ext2fs_attrs

Passed

N/A

2.322717s

ext2fs_create_exist

Passed

N/A

2.481011s

ext2fs_create_many

Passed

N/A

28.583137s

ext2fs_create_nametoolong

Passed

N/A

2.228397s

ext2fs_create_nonalphanum

Passed

N/A

3.798667s

ext2fs_dir_notempty

Passed

N/A

2.055111s

ext2fs_dir_rmdirdotdot

Passed

N/A

2.053147s

ext2fs_dir_simple

Passed

N/A

1.886240s

ext2fs_fcntl_getlock_pids

Passed

N/A

2.484259s

ext2fs_fcntl_lock

Passed

N/A

2.532006s

ext2fs_lookup_complex

Passed

N/A

2.610368s

ext2fs_lookup_simple

Passed

N/A

1.914984s

ext2fs_lstat_symlink

Passed

N/A

2.337126s

ext2fs_read_directory

Passed

N/A

2.379196s

ext2fs_rename_dir

Passed

N/A

2.634480s

ext2fs_rename_dotdot

Passed

N/A

2.322758s

ext2fs_rename_nametoolong

Passed

N/A

2.512920s

ext2fs_rename_reg_nodir

Passed

N/A

2.226703s

ext2fs_symlink_long

Passed

N/A

2.839445s

ext2fs_symlink_root

Passed

N/A

2.319977s

ext2fs_symlink_zerolen

Passed

N/A

2.058562s

ffs_access_simple

Passed

N/A

2.398092s

ffs_attrs

Passed

N/A

2.557739s

ffs_create_exist

Passed

N/A

2.887177s

ffs_create_many

Passed

N/A

19.275507s

ffs_create_nametoolong

Passed

N/A

3.041545s

ffs_create_nonalphanum

Passed

N/A

5.158790s

ffs_dir_notempty

Passed

N/A

2.735512s

ffs_dir_rmdirdotdot

Passed

N/A

2.536997s

ffs_dir_simple

Passed

N/A

2.675140s

ffs_fcntl_getlock_pids

Passed

N/A

2.076435s

ffs_fcntl_lock

Passed

N/A

2.714649s

ffs_lookup_complex

Passed

N/A

2.171930s

ffs_lookup_simple

Passed

N/A

1.711280s

ffs_lstat_symlink

Passed

N/A

2.342813s

ffs_read_directory

Passed

N/A

2.025468s

ffs_rename_dir

Passed

N/A

2.196521s

ffs_rename_dotdot

Passed

N/A

2.256691s

ffs_rename_nametoolong

Passed

N/A

2.539997s

ffs_rename_reg_nodir

Passed

N/A

2.691904s

ffs_symlink_long

Passed

N/A

2.926137s

ffs_symlink_root

Passed

N/A

2.888636s

ffs_symlink_zerolen

Passed

N/A

2.468886s

ffslog_access_simple

Passed

N/A

3.060775s

ffslog_attrs

Passed

N/A

3.199843s

ffslog_create_exist

Passed

N/A

2.515551s

ffslog_create_many

Passed

N/A

10.346878s

ffslog_create_nametoolong

Passed

N/A

4.468655s

ffslog_create_nonalphanum

Passed

N/A

4.484314s

ffslog_dir_notempty

Passed

N/A

3.027423s

ffslog_dir_rmdirdotdot

Passed

N/A

3.051414s

ffslog_dir_simple

Passed

N/A

3.028798s

ffslog_fcntl_getlock_pids

Passed

N/A

2.955281s

ffslog_fcntl_lock

Passed

N/A

3.128538s

ffslog_lookup_complex

Passed

N/A

3.029000s

ffslog_lookup_simple

Passed

N/A

2.857645s

ffslog_lstat_symlink

Passed

N/A

1.633092s

ffslog_read_directory

Passed

N/A

1.977382s

ffslog_rename_dir

Passed

N/A

2.297464s

ffslog_rename_dotdot

Passed

N/A

1.967947s

ffslog_rename_nametoolong

Passed

N/A

2.119837s

ffslog_rename_reg_nodir

Passed

N/A

2.133421s

ffslog_symlink_long

Passed

N/A

2.785556s

ffslog_symlink_root

Passed

N/A

2.855335s

ffslog_symlink_zerolen

Passed

N/A

2.763466s

lfs_access_simple

Passed

N/A

5.050359s

lfs_attrs

Passed

N/A

5.613771s

lfs_create_exist

Passed

N/A

5.349771s

lfs_create_many

Passed

N/A

42.157968s

lfs_create_nametoolong

Passed

N/A

3.614261s

lfs_create_nonalphanum

Passed

N/A

27.488461s

lfs_dir_notempty

Passed

N/A

4.965032s

lfs_dir_rmdirdotdot

Passed

N/A

5.204678s

lfs_dir_simple

Passed

N/A

5.600257s

lfs_fcntl_getlock_pids

Passed

N/A

4.916394s

lfs_fcntl_lock

Passed

N/A

5.675373s

lfs_lookup_complex

Passed

N/A

5.324782s

lfs_lookup_simple

Passed

N/A

5.012394s

lfs_lstat_symlink

Passed

N/A

5.369756s

lfs_read_directory

Passed

N/A

5.275488s

lfs_rename_dir

Passed

N/A

4.604796s

lfs_rename_dotdot

Passed

N/A

4.896566s

lfs_rename_nametoolong

Passed

N/A

4.650424s

lfs_rename_reg_nodir

Passed

N/A

5.771321s

lfs_symlink_long

Passed

N/A

5.834590s

lfs_symlink_root

Passed

N/A

5.345156s

lfs_symlink_zerolen

Passed

N/A

4.906834s

msdosfs_access_simple

Passed

N/A

2.781832s

msdosfs_attrs

Passed

N/A

2.313535s

msdosfs_create_exist

Passed

N/A

2.089802s

msdosfs_create_many

Passed

N/A

45.555050s

msdosfs_create_nametoolong

Passed

N/A

2.513324s

msdosfs_create_nonalphanum

Passed

N/A

4.152944s

msdosfs_dir_notempty

Passed

N/A

2.642360s

msdosfs_dir_rmdirdotdot

Passed

N/A

2.736545s

msdosfs_dir_simple

Passed

N/A

2.792457s

msdosfs_fcntl_getlock_pids

Passed

N/A

2.962587s

msdosfs_fcntl_lock

Passed

N/A

2.785164s

msdosfs_lookup_complex

Passed

N/A

2.281267s

msdosfs_lookup_simple

Passed

N/A

2.691405s

msdosfs_lstat_symlink

Skipped

symlinks not supported by file system

2.782812s

msdosfs_read_directory

Passed

N/A

2.892274s

msdosfs_rename_dir

Passed

N/A

2.922592s

msdosfs_rename_dotdot

Passed

N/A

2.799853s

msdosfs_rename_nametoolong

Passed

N/A

2.443093s

msdosfs_rename_reg_nodir

Passed

N/A

1.444685s

msdosfs_symlink_long

Skipped

symlinks not supported by file system

1.443240s

msdosfs_symlink_root

Skipped

symlinks not supported by file system

1.472492s

msdosfs_symlink_zerolen

Skipped

symlinks not supported by file system

1.447912s

nfs_access_simple

Passed

N/A

5.657489s

nfs_attrs

Passed

N/A

7.791378s

nfs_create_exist

Passed

N/A

8.292317s

nfs_create_many

Passed

N/A

96.871848s

nfs_create_nametoolong

Passed

N/A

7.482551s

nfs_create_nonalphanum

Passed

N/A

14.511366s

nfs_dir_notempty

Passed

N/A

6.851360s

nfs_dir_rmdirdotdot

Passed

N/A

8.056674s

nfs_dir_simple

Passed

N/A

8.317688s

nfs_fcntl_getlock_pids

Passed

N/A

8.147651s

nfs_fcntl_lock

Passed

N/A

7.657803s

nfs_lookup_complex

Passed

N/A

7.559348s

nfs_lookup_simple

Passed

N/A

7.158674s

nfs_lstat_symlink

Failed

Test program received signal 11 (core dumped)

6.410587s

nfs_read_directory

Passed

N/A

7.438565s

nfs_rename_dir

Passed

N/A

7.829200s

nfs_rename_dotdot

Passed

N/A

6.717552s

nfs_rename_nametoolong

Passed

N/A

5.949099s

nfs_rename_reg_nodir

Passed

N/A

6.826484s

nfs_symlink_long

Passed

N/A

9.313451s

nfs_symlink_root

Passed

N/A

6.121389s

nfs_symlink_zerolen

Passed

N/A

5.606449s

p2k_ffs_access_simple

Passed

N/A

3.697418s

p2k_ffs_attrs

Passed

N/A

4.392110s

p2k_ffs_create_exist

Passed

N/A

3.610116s

p2k_ffs_create_many

Passed

N/A

50.480040s

p2k_ffs_create_nametoolong

Passed

N/A

4.351585s

p2k_ffs_create_nonalphanum

Passed

N/A

11.621371s

p2k_ffs_dir_notempty

Passed

N/A

4.619979s

p2k_ffs_dir_rmdirdotdot

Passed

N/A

2.997471s

p2k_ffs_dir_simple

Passed

N/A

2.925747s

p2k_ffs_fcntl_getlock_pids

Passed

N/A

3.258756s

p2k_ffs_fcntl_lock

Passed

N/A

3.891221s

p2k_ffs_lookup_complex

Passed

N/A

4.322959s

p2k_ffs_lookup_simple

Passed

N/A

2.705768s

p2k_ffs_lstat_symlink

Passed

N/A

3.206024s

p2k_ffs_read_directory

Passed

N/A

3.800091s

p2k_ffs_rename_dir

Passed

N/A

4.793274s

p2k_ffs_rename_dotdot

Passed

N/A

3.366137s

p2k_ffs_rename_nametoolong

Passed

N/A

3.906813s

p2k_ffs_rename_reg_nodir

Passed

N/A

4.547522s

p2k_ffs_symlink_long

Passed

N/A

5.307457s

p2k_ffs_symlink_root

Passed

N/A

3.348881s

p2k_ffs_symlink_zerolen

Passed

N/A

4.302708s

puffs_access_simple

Passed

N/A

1.678982s

puffs_attrs

Passed

N/A

2.215043s

puffs_create_exist

Passed

N/A

2.115404s

puffs_create_many

Passed

N/A

26.222017s

puffs_create_nametoolong

Passed

N/A

2.156205s

puffs_create_nonalphanum

Passed

N/A

5.750818s

puffs_dir_notempty

Passed

N/A

2.563609s

puffs_dir_rmdirdotdot

Passed

N/A

2.472627s

puffs_dir_simple

Passed

N/A

2.440727s

puffs_fcntl_getlock_pids

Passed

N/A

2.243063s

puffs_fcntl_lock

Passed

N/A

2.231619s

puffs_lookup_complex

Passed

N/A

2.345896s

puffs_lookup_simple

Passed

N/A

2.867670s

puffs_lstat_symlink

Passed

N/A

2.437377s

puffs_read_directory

Passed

N/A

2.459446s

puffs_rename_dir

Passed

N/A

2.922186s

puffs_rename_dotdot

Passed

N/A

2.194760s

puffs_rename_nametoolong

Passed

N/A

2.057742s

puffs_rename_reg_nodir

Passed

N/A

2.536247s

puffs_symlink_long

Passed

N/A

2.777397s

puffs_symlink_root

Passed

N/A

2.391976s

puffs_symlink_zerolen

Passed

N/A

2.550682s

rumpfs_access_simple

Passed

N/A

1.822053s

rumpfs_attrs

Passed

N/A

1.326482s

rumpfs_create_exist

Passed

N/A

1.775630s

rumpfs_create_many

Passed

N/A

7.202844s

rumpfs_create_nametoolong

Passed

N/A

2.652226s

rumpfs_create_nonalphanum

Passed

N/A

2.546801s

rumpfs_dir_notempty

Passed

N/A

2.048262s

rumpfs_dir_rmdirdotdot

Passed

N/A

1.601689s

rumpfs_dir_simple

Passed

N/A

1.945834s

rumpfs_fcntl_getlock_pids

Passed

N/A

1.581787s

rumpfs_fcntl_lock

Passed

N/A

2.022569s

rumpfs_lookup_complex

Passed

N/A

1.598151s

rumpfs_lookup_simple

Passed

N/A

1.698209s

rumpfs_lstat_symlink

Passed

N/A

1.468241s

rumpfs_read_directory

Passed

N/A

1.996253s

rumpfs_rename_dir

Skipped

rename not supported by file system

1.689975s

rumpfs_rename_dotdot

Skipped

rename not supported by file system

1.568256s

rumpfs_rename_nametoolong

Skipped

rename not supported by file system

2.249436s

rumpfs_rename_reg_nodir

Skipped

rename not supported by file system

2.071212s

rumpfs_symlink_long

Passed

N/A

1.425328s

rumpfs_symlink_root

Passed

N/A

2.050460s

rumpfs_symlink_zerolen

Passed

N/A

2.751180s

sysvbfs_access_simple

Passed

N/A

1.458715s

sysvbfs_attrs

Passed

N/A

1.587855s

sysvbfs_create_exist

Passed

N/A

1.937931s

sysvbfs_create_many

Passed

N/A

2.047465s

sysvbfs_create_nametoolong

Passed

N/A

2.674837s

sysvbfs_create_nonalphanum

Passed

N/A

2.707615s

sysvbfs_dir_notempty

Skipped

directories not supported by file system

2.571739s

sysvbfs_dir_rmdirdotdot

Skipped

directories not supported by file system

2.610777s

sysvbfs_dir_simple

Skipped

directories not supported by file system

2.326994s

sysvbfs_fcntl_getlock_pids

Passed

N/A

1.975474s

sysvbfs_fcntl_lock

Passed

N/A

1.996479s

sysvbfs_lookup_complex

Skipped

directories not supported by file system

2.494407s

sysvbfs_lookup_simple

Passed

N/A

2.649801s

sysvbfs_lstat_symlink

Skipped

symlinks not supported by file system

2.471588s

sysvbfs_read_directory

Passed

N/A

2.621182s

sysvbfs_rename_dir

Skipped

directories not supported by file system

2.520631s

sysvbfs_rename_dotdot

Skipped

directories not supported by file system

2.536539s

sysvbfs_rename_nametoolong

Passed

N/A

1.669557s

sysvbfs_rename_reg_nodir

Passed

N/A

1.476797s

sysvbfs_symlink_long

Skipped

symlinks not supported by file system

1.442470s

sysvbfs_symlink_root

Skipped

symlinks not supported by file system

1.359324s

sysvbfs_symlink_zerolen

Skipped

symlinks not supported by file system

1.821567s

tmpfs_access_simple

Passed

N/A

1.250193s

tmpfs_attrs

Passed

N/A

1.304157s

tmpfs_create_exist

Passed

N/A

1.295470s

tmpfs_create_many

Passed

N/A

7.174297s

tmpfs_create_nametoolong

Passed

N/A

2.189499s

tmpfs_create_nonalphanum

Passed

N/A

2.604499s

tmpfs_dir_notempty

Passed

N/A

1.735619s

tmpfs_dir_rmdirdotdot

Passed

N/A

1.616033s

tmpfs_dir_simple

Passed

N/A

1.991093s

tmpfs_fcntl_getlock_pids

Passed

N/A

2.237592s

tmpfs_fcntl_lock

Passed

N/A

1.560589s

tmpfs_lookup_complex

Passed

N/A

1.309958s

tmpfs_lookup_simple

Passed

N/A

1.643627s

tmpfs_lstat_symlink

Passed

N/A

1.384105s

tmpfs_read_directory

Passed

N/A

1.745629s

tmpfs_rename_dir

Passed

N/A

2.200957s

tmpfs_rename_dotdot

Passed

N/A

1.367467s

tmpfs_rename_nametoolong

Passed

N/A

2.063128s

tmpfs_rename_reg_nodir

Passed

N/A

2.194992s

tmpfs_symlink_long

Passed

N/A

2.298703s

tmpfs_symlink_root

Passed

N/A

2.032819s

tmpfs_symlink_zerolen

Passed

N/A

2.180471s

udf_access_simple

Passed

N/A

3.384687s

udf_attrs

Passed

N/A

3.051707s

udf_create_exist

Passed

N/A

3.028249s

udf_create_many

Passed

N/A

12.322149s

udf_create_nametoolong

Passed

N/A

2.603332s

udf_create_nonalphanum

Passed

N/A

2.669000s

udf_dir_notempty

Passed

N/A

2.600329s

udf_dir_rmdirdotdot

Passed

N/A

3.292221s

udf_dir_simple

Passed

N/A

3.260731s

udf_fcntl_getlock_pids

Passed

N/A

3.226324s

udf_fcntl_lock

Passed

N/A

3.040586s

udf_lookup_complex

Expected failure

PR kern/49033: stat results differ, see ouput for more details

2.450999s

udf_lookup_simple

Passed

N/A

3.074619s

udf_lstat_symlink

Passed

N/A

2.590869s

udf_read_directory

Passed

N/A

2.492253s

udf_rename_dir

Passed

N/A

3.300789s

udf_rename_dotdot

Passed

N/A

3.574076s

udf_rename_nametoolong

Passed

N/A

2.720220s

udf_rename_reg_nodir

Passed

N/A

1.717651s

udf_symlink_long

Passed

N/A

2.237912s

udf_symlink_root

Passed

N/A

3.444343s

udf_symlink_zerolen

Passed

N/A

3.101374s

v7fs_access_simple

Passed

N/A

2.609149s

v7fs_attrs

Passed

N/A

2.365992s

v7fs_create_exist

Passed

N/A

2.818996s

v7fs_create_many

Passed

N/A

68.586588s

v7fs_create_nametoolong

Passed

N/A

2.872730s

v7fs_create_nonalphanum

Passed

N/A

6.124650s

v7fs_dir_notempty

Passed

N/A

1.759920s

v7fs_dir_rmdirdotdot

Passed

N/A

2.185259s

v7fs_dir_simple

Passed

N/A

3.100357s

v7fs_fcntl_getlock_pids

Passed

N/A

3.034129s

v7fs_fcntl_lock

Passed

N/A

2.011829s

v7fs_lookup_complex

Passed

N/A

2.471070s

v7fs_lookup_simple

Passed

N/A

2.646032s

v7fs_lstat_symlink

Passed

N/A

2.282297s

v7fs_read_directory

Passed

N/A

2.835692s

v7fs_rename_dir

Passed

N/A

3.118436s

v7fs_rename_dotdot

Passed

N/A

2.246176s

v7fs_rename_nametoolong

Passed

N/A

2.344131s

v7fs_rename_reg_nodir

Passed

N/A

2.596756s

v7fs_symlink_long

Passed

N/A

2.829569s

v7fs_symlink_root

Passed

N/A

2.728434s

v7fs_symlink_zerolen

Passed

N/A

2.562907s

fs/cd9660/t_high_ino_big_file

1.782168s

pr_kern_48787

Skipped

not enough free disk space, have 357848 Kbytes, need ~ 4500000 Kbytes

1.687573s

rump/rumpkern/t_copy

1.608217s

copy_efault

Passed

N/A

0.128077s

copyinstr

Passed

N/A

0.560621s

copyoutstr

Passed

N/A

0.413867s

copystr

Passed

N/A

0.376385s

rump/rumpkern/t_kern

3.483938s

lockme_DESTROYHELD

Passed

N/A

0.448443s

lockme_DOUBLEFREE

Passed

N/A

0.522453s

lockme_DOUBLEINIT

Skipped

test requires LOCKDEBUG kernel

0.151489s

lockme_MEMFREE

Skipped

test requires LOCKDEBUG kernel

0.220162s

lockme_MTX

Passed

N/A

0.563119s

lockme_RWDOUBLEX

Passed

N/A

0.641435s

lockme_RWRX

Skipped

test requires LOCKDEBUG kernel

0.128173s

lockme_RWXR

Passed

N/A

0.552052s

rump/rumpkern/t_lwproc

5.983714s

inherit

Passed

N/A

0.488920s

lwps

Passed

N/A

0.682966s

makelwp

Passed

N/A

0.664227s

nolwp

Passed

N/A

0.672043s

nolwprelease

Passed

N/A

0.868364s

nullswitch

Passed

N/A

0.767102s

proccreds

Passed

N/A

0.711810s

rfork

Passed

N/A

0.700959s

rump/rumpkern/t_modcmd

0.775322s

cmsg_modcmd

Passed

N/A

0.725948s

rump/rumpkern/t_modlinkset

0.716489s

modlinkset

Passed

N/A

0.638137s

rump/rumpkern/t_signals

2.165527s

sigignore

Passed

N/A

0.528068s

sigpanic

Passed

N/A

0.792833s

sigraise

Passed

N/A

0.676828s

rump/rumpkern/t_threads

1.444574s

kthread

Passed

N/A

0.650232s

threadjoin

Passed

N/A

0.675361s

rump/rumpkern/t_tsleep

2.067491s

tsleep

Passed

N/A

2.003348s

rump/rumpkern/t_vm

11.610906s

busypage

Passed

N/A

0.547638s

uvmwait

Passed

N/A

10.952375s

rump/rumpkern/t_sp

49.716802s

basic

Passed

N/A

1.941202s

fork_fakeauth

Passed

N/A

2.286929s

fork_pipecomm

Passed

N/A

2.494504s

fork_simple

Passed

N/A

2.407140s

reconnect

Passed

N/A

6.899241s

signal

Passed

N/A

3.048333s

sigsafe

Passed

N/A

8.321044s

stress_killer

Passed

N/A

21.771477s

stress_long

Skipped

Not enough memory; needed 67108864, available 41504768

0.028047s

stress_short

Skipped

Not enough memory; needed 67108864, available 41504768

0.002380s

rump/rumpnet/t_shmif

179.576632s

crossping

Failed

atf-check failed; see the output of the test for details

179.430926s

rump/rumpvfs/t_basic

0.827727s

lseekrv

Passed

N/A

0.742701s

rump/rumpvfs/t_etfs

6.984690s

key

Passed

N/A

0.652872s

large_blk

Passed

N/A

2.336922s

range_blk

Passed

N/A

1.460247s

reregister_blk

Passed

N/A

1.495942s

reregister_reg

Passed

N/A

0.623435s

rump/rumpvfs/t_p2kifs

0.683341s

makecn

Passed

N/A

0.615654s

rump/modautoload/t_modautoload

0.896301s

modautoload

Passed

N/A

0.720057s

modules/t_modctl

2.521698s

cmd_load

Passed

N/A

0.382670s

cmd_load_props

Passed

N/A

0.575948s

cmd_load_recurse

Passed

N/A

0.549993s

cmd_stat

Passed

N/A

0.387620s

cmd_unload

Passed

N/A

0.434192s

modules/t_builtin

5.034289s

busydisable

Passed

N/A

0.892709s

disable

Passed

N/A

0.968058s

disabledstat

Passed

N/A

0.900942s

forcereload

Passed

N/A

0.966611s

noauto

Passed

N/A

0.946315s

modules/t_abi_uvm

3.561391s

PAGE_SIZE

Passed

N/A

3.470557s

modules/t_modload

23.885990s

bflag

Passed

N/A

8.021866s

iflag

Failed

atf-check failed; see the output of the test for details

3.233531s

plain

Passed

N/A

5.486959s

sflag

Passed

N/A

6.793908s

crypto/libcrypto/t_certs

1.507983s

x509v3

Passed

N/A

1.447421s

crypto/libcrypto/t_ciphers

47.597880s

bf

Failed

Test case exited normally but failed to create the results file: Failed to open /tmp/atf-run.tVy7US/tcr

0.593868s

cast

Passed

N/A

36.936035s

des

Passed

N/A

1.504394s

evp

Passed

N/A

2.221075s

idea

Passed

N/A

1.633192s

rc2

Passed

N/A

1.431755s

rc4

Passed

N/A

1.908758s

rc5

Skipped

RC5 support not available; system built with MKCRYPTO_RC5=no

0.907700s

crypto/libcrypto/t_hashes

10.630658s

hmac

Passed

N/A

1.376424s

md2

Passed

N/A

1.481811s

md4

Passed

N/A

1.463868s

md5

Passed

N/A

1.446708s

mdc2

Passed

N/A

1.474228s

ripemd

Passed

N/A

1.372077s

sha

Passed

N/A

1.519614s

crypto/libcrypto/t_libcrypto

80.009126s

bn

Passed

N/A

70.058065s

conf

Passed

N/A

1.720421s

engine

Passed

N/A

2.202943s

lhash

Passed

N/A

1.740066s

rand

Passed

N/A

1.370585s

threads

Passed

N/A

2.506133s

crypto/libcrypto/t_pubkey

250.848988s

dh

Passed

N/A

1.864084s

dsa

Passed

N/A

4.487502s

ec

Passed

N/A

90.645371s

ecdh

Passed

N/A

13.658623s

ecdsa

Passed

N/A

84.549908s

rsa

Passed

N/A

52.565157s

srp

Passed

N/A

2.586297s

crypto/opencrypto/t_opencrypto

50.714191s

aesctr1

Passed

N/A

4.557145s

aesctr2

Passed

N/A

4.763865s

arc4

Skipped

ARC4 not implemented by swcrypto

2.464548s

camellia

Passed

N/A

4.280605s

cbcdes

Passed

N/A

4.593625s

comp

Passed

N/A

4.626249s

comp_deflate

Passed

N/A

4.276028s

comp_zlib_rnd

Passed

N/A

4.036441s

gcm

Passed

N/A

3.496527s

md5

Passed

N/A

2.536610s

md5_hmac

Passed

N/A

2.438984s

null

Passed

N/A

2.437498s

sha1_hmac

Passed

N/A

2.776978s

xcbcmac

Passed

N/A

2.473704s

ipf/t_filter_exec

138.883622s

f1

Passed

N/A

3.524237s

f10

Failed

atf-check failed; see the output of the test for details

10.870732s

f11

Passed

N/A

6.222082s

f12

Passed

N/A

5.469107s

f13

Passed

N/A

7.309133s

f14

Passed

N/A

6.433653s

f15

Passed

N/A

1.801569s

f16

Passed

N/A

1.869627s

f17

Passed

N/A

1.782365s

f18

Passed

N/A

1.947533s

f19

Passed

N/A

2.601209s

f2

Passed

N/A

4.863187s

f20

Passed

N/A

1.253892s

f24

Passed

N/A

1.126491s

f25

Passed

N/A

1.029298s

f26

Expected failure

Known to be broken: results differ

3.042582s

f27

Expected failure

Known to be broken: atf-check failed; see the output of the test for details

1.865368s

f3

Passed

N/A

3.645672s

f30

Passed

N/A

2.224273s

f4

Passed

N/A

3.742502s

f5

Failed

atf-check failed; see the output of the test for details

3.842559s

f6

Passed

N/A

23.967887s

f7

Passed

N/A

6.804790s

f8

Passed

N/A

5.275198s

f9

Passed

N/A

10.592119s

ipv6_1

Passed

N/A

2.029350s

ipv6_2

Passed

N/A

3.490403s

ipv6_3

Passed

N/A

2.214922s

ipv6_5

Passed

N/A

3.101276s

ipv6_6

Passed

N/A

2.989904s

ipf/t_filter_parse

36.401501s

i1

Passed

N/A

1.581091s

i10

Passed

N/A

1.556390s

i11

Passed

N/A

1.648821s

i12

Passed

N/A

1.395025s

i13

Passed

N/A

1.444581s

i14

Passed

N/A

1.448619s

i15

Passed

N/A

1.369438s

i16

Passed

N/A

1.447133s

i17

Expected failure

Known to be broken: atf-check failed; see the output of the test for details

1.702961s

i18

Passed

N/A

1.655751s

i19

Passed

N/A

2.999807s

i2

Failed

atf-check failed; see the output of the test for details

1.819616s

i20

Passed

N/A

1.632124s

i21

Passed

N/A

1.571645s

i22

Passed

N/A

1.631464s

i23

Passed

N/A

1.238123s

i3

Passed

N/A

1.237690s

i4

Passed

N/A

1.283769s

i5

Passed

N/A

1.224370s

i6

Passed

N/A

1.388951s

i7

Passed

N/A

1.541344s

i8

Passed

N/A

1.393069s

i9

Passed

N/A

1.086358s

ipf/t_logging

3.406998s

l1

Failed

atf-check failed; see the output of the test for details

3.336839s

ipf/t_nat_exec

115.367415s

n1

Failed

atf-check failed; see the output of the test for details

0.988136s

n10

Passed

N/A

2.820813s

n100

Passed

N/A

1.380267s

n101

Passed

N/A

1.468504s

n102

Failed

Test input file missing

0.867686s

n103

Passed

N/A

1.320772s

n104

Passed

N/A

1.289576s

n105

Passed

N/A

1.332238s

n106

Passed

N/A

1.786417s

n11

Passed

N/A

2.922648s

n11_6

Passed

N/A

3.009936s

n12

Passed

N/A

2.194024s

n12_6

Passed

N/A

2.333235s

n13

Passed

N/A

2.261852s

n14

Passed

N/A

1.962039s

n15_6

Passed

N/A

3.391054s

n16

Passed

N/A

2.354097s

n17

Passed

N/A

2.287971s

n1_6

Passed

N/A

4.229726s

n2

Passed

N/A

5.135375s

n200

Passed

N/A

2.232064s

n2_6

Passed

N/A

5.041810s

n3

Passed

N/A

3.190370s

n4

Passed

N/A

6.268874s

n4_6

Passed

N/A

7.092479s

n5

Passed

N/A

7.603492s

n5_6

Passed

N/A

7.916375s

n6

Failed

atf-check failed; see the output of the test for details

2.445500s

n6_6

Passed

N/A

6.430570s

n7

Passed

N/A

4.734120s

n7_6

Passed

N/A

4.891325s

n8

Passed

N/A

2.666474s

n8_6

Passed

N/A

2.565715s

n9

Passed

N/A

2.617441s

n9_6

Passed

N/A

2.340753s

ipf/t_nat_ipf_exec

54.029695s

ni1

Passed

N/A

2.459233s

ni10

Passed

N/A

2.458906s

ni11

Passed

N/A

2.430601s

ni12

Passed

N/A

2.330023s

ni13

Passed

N/A

2.461874s

ni14

Passed

N/A

2.730234s

ni15

Passed

N/A

2.680769s

ni16

Passed

N/A

2.499868s

ni17

Passed

N/A

2.037135s

ni18

Passed

N/A

2.165877s

ni19

Passed

N/A

2.477355s

ni2

Passed

N/A

2.371493s

ni20

Passed

N/A

2.494437s

ni21

Passed

N/A

2.213963s

ni23

Passed

N/A

2.361566s

ni3

Passed

N/A

2.466549s

ni4

Passed

N/A

2.369571s

ni5

Passed

N/A

2.371783s

ni6

Passed

N/A

2.014869s

ni7

Passed

N/A

2.257782s

ni8

Passed

N/A

2.356526s

ni9

Passed

N/A

2.356813s

ipf/t_nat_parse

32.204472s

in1

Passed

N/A

1.716915s

in100

Passed

N/A

1.584870s

in100_6

Passed

N/A

1.553430s

in101

Passed

N/A

1.794106s

in101_6

Passed

N/A

1.710795s

in102

Passed

N/A

1.555044s

in102_6

Passed

N/A

1.352987s

in1_6

Passed

N/A

1.580001s

in2

Passed

N/A

1.735071s

in2_6

Passed

N/A

1.390025s

in3

Passed

N/A

1.735110s

in3_6

Passed

N/A

1.681456s

in4

Failed

atf-check failed; see the output of the test for details

1.262588s

in4_6

Passed

N/A

1.590518s

in5

Passed

N/A

1.540388s

in5_6

Passed

N/A

1.590204s

in6

Passed

N/A

1.571744s

in6_6

Passed

N/A

1.303391s

in7

Passed

N/A

1.479485s

in8_6

Passed

N/A

1.473839s

ipf/t_pools

35.605916s

f28

Passed

N/A

2.010186s

f29

Passed

N/A

2.198626s

ip1

Passed

N/A

2.048082s

ip2

Passed

N/A

1.867591s

ip3

Passed

N/A

2.011092s

p1

Passed

N/A

1.907010s

p10

Passed

N/A

1.994339s

p11

Passed

N/A

2.250579s

p12

Passed

N/A

1.756766s

p13

Passed

N/A

1.953187s

p2

Passed

N/A

2.097783s

p3

Passed

N/A

2.050369s

p4

Passed

N/A

2.169195s

p5

Passed

N/A

2.062257s

p6

Passed

N/A

2.021545s

p7

Passed

N/A

2.071166s

p9

Passed

N/A

2.046764s

share/examples/t_asm

3.414566s

hello

Skipped

Example program not implemented on this platform

3.310997s

share/mk/t_lib

45.503498s

defaults__build_and_install

Passed

N/A

45.298402s

share/mk/t_own

7.889529s

makeconf__missing

Passed

N/A

3.006312s

makeconf__ok

Passed

N/A

4.669319s

share/mk/t_prog

28.542172s

defaults__build_and_install

Failed

atf-check failed; see the output of the test for details

12.179027s

without_man__build_and_install

Passed

N/A

16.118928s

share/mk/t_test

95.600519s

one_c

Failed

atf-check failed; see the output of the test for details

21.150415s

one_cxx

Passed

N/A

65.406836s

one_sh

Passed

N/A

8.708167s

atf/atf-c/detail/dynstr_test

10.102778s

append_ap

Passed

N/A

1.351720s

append_fmt

Passed

N/A

1.259955s

clear

Passed

N/A

0.236228s

copy

Passed

N/A

0.168651s

cstring

Passed

N/A

0.075029s

equal_cstring

Passed

N/A

0.094822s

equal_dynstr

Passed

N/A

0.082616s

fini_disown

Passed

N/A

0.090938s

init

Passed

N/A

0.152085s

init_ap

Passed

N/A

0.165773s

init_fmt

Passed

N/A

0.093612s

init_raw

Passed

N/A

0.435671s

init_rep

Passed

N/A

0.501423s

init_substr

Passed

N/A

0.092510s

length

Passed

N/A

0.357136s

prepend_ap

Passed

N/A

2.136485s

prepend_fmt

Passed

N/A

2.404585s

rfind_ch

Passed

N/A

0.091548s

atf/atf-c/detail/env_test

0.639114s

get

Passed

N/A

0.270521s

has

Passed

N/A

0.086377s

set

Passed

N/A

0.091687s

unset

Passed

N/A

0.086731s

atf/atf-c/detail/fs_test

4.121978s

eaccess

Passed

N/A

0.434090s

exists

Passed

N/A

0.171464s

getcwd

Passed

N/A

0.098294s

mkdtemp_err

Passed

N/A

0.126639s

mkdtemp_ok

Passed

N/A

0.117018s

mkdtemp_umask

Passed

N/A

0.258586s

mkstemp_err

Passed

N/A

0.145896s

mkstemp_ok

Passed

N/A

0.066029s

mkstemp_umask

Passed

N/A

0.063673s

path_append

Passed

N/A

0.104482s

path_branch_path

Passed

N/A

0.212955s

path_copy

Passed

N/A

0.155984s

path_equal

Passed

N/A

0.096387s

path_is_absolute

Passed

N/A

0.121418s

path_is_root

Passed

N/A

0.098056s

path_leaf_name

Passed

N/A

0.189347s

path_normalize

Passed

N/A

0.268592s

path_to_absolute

Passed

N/A

0.116878s

rmdir_empty

Passed

N/A

0.100759s

rmdir_enotempty

Passed

N/A

0.100053s

rmdir_eperm

Passed

N/A

0.107483s

stat_mode

Passed

N/A

0.183022s

stat_perms

Passed

N/A

0.192163s

stat_type

Passed

N/A

0.096672s

atf/atf-c/detail/list_test

1.116202s

list_append

Passed

N/A

0.082516s

list_append_list

Passed

N/A

0.054960s

list_for_each

Passed

N/A

0.188009s

list_for_each_c

Passed

N/A

0.101000s

list_index

Passed

N/A

0.084768s

list_index_c

Passed

N/A

0.055505s

list_init

Passed

N/A

0.081276s

list_to_charpp_empty

Passed

N/A

0.087951s

list_to_charpp_some

Passed

N/A

0.212959s

atf/atf-c/detail/map_test

1.941258s

find

Passed

N/A

0.117795s

find_c

Passed

N/A

0.090881s

map_for_each

Passed

N/A

0.183801s

map_for_each_c

Passed

N/A

0.317202s

map_init

Passed

N/A

0.151309s

map_init_charpp_empty

Passed

N/A

0.092901s

map_init_charpp_null

Passed

N/A

0.090313s

map_init_charpp_short

Passed

N/A

0.065175s

map_init_charpp_some

Passed

N/A

0.054925s

map_insert

Passed

N/A

0.224949s

stable_keys

Passed

N/A

0.162106s

to_charpp_empty

Passed

N/A

0.093950s

to_charpp_some

Passed

N/A

0.101628s

atf/atf-c/detail/process_test

12.394955s

child_pid

Passed

N/A

0.285503s

child_wait_eintr

Passed

N/A

2.224713s

exec_failure

Passed

N/A

0.156324s

exec_list

Passed

N/A

0.290937s

exec_prehook

Passed

N/A

0.192869s

exec_success

Passed

N/A

0.159124s

fork_cookie

Passed

N/A

0.136294s

fork_out_capture_err_capture

Passed

N/A

0.143593s

fork_out_capture_err_connect

Passed

N/A

0.317573s

fork_out_capture_err_default

Passed

N/A

0.197086s

fork_out_capture_err_inherit

Passed

N/A

0.144333s

fork_out_capture_err_redirect_fd

Passed

N/A

0.126157s

fork_out_capture_err_redirect_path

Passed

N/A

0.296844s

fork_out_connect_err_capture

Passed

N/A

0.243538s

fork_out_connect_err_connect

Passed

N/A

0.143577s

fork_out_connect_err_default

Passed

N/A

0.147869s

fork_out_connect_err_inherit

Passed

N/A

0.295703s

fork_out_connect_err_redirect_fd

Passed

N/A

0.217911s

fork_out_connect_err_redirect_path

Passed

N/A

0.149217s

fork_out_default_err_capture

Passed

N/A

0.121682s

fork_out_default_err_connect

Passed

N/A

0.152378s

fork_out_default_err_default

Passed

N/A

0.305579s

fork_out_default_err_inherit

Passed

N/A

0.145637s

fork_out_default_err_redirect_fd

Passed

N/A

0.148556s

fork_out_default_err_redirect_path

Passed

N/A

0.121870s

fork_out_inherit_err_capture

Passed

N/A

0.175179s

fork_out_inherit_err_connect

Passed

N/A

0.144723s

fork_out_inherit_err_default

Passed

N/A

0.086289s

fork_out_inherit_err_inherit

Passed

N/A

0.133272s

fork_out_inherit_err_redirect_fd

Passed

N/A

0.145937s

fork_out_inherit_err_redirect_path

Passed

N/A

0.332809s

fork_out_redirect_fd_err_capture

Passed

N/A

0.147133s

fork_out_redirect_fd_err_connect

Passed

N/A

0.152021s

fork_out_redirect_fd_err_default

Passed

N/A

0.137993s

fork_out_redirect_fd_err_inherit

Passed

N/A

0.292782s

fork_out_redirect_fd_err_redirect_fd

Passed

N/A

0.212167s

fork_out_redirect_fd_err_redirect_path

Passed

N/A

0.148873s

fork_out_redirect_path_err_capture

Passed

N/A

0.160652s

fork_out_redirect_path_err_connect

Passed

N/A

0.306648s

fork_out_redirect_path_err_default

Passed

N/A

0.232323s

fork_out_redirect_path_err_inherit

Passed

N/A

0.134028s

fork_out_redirect_path_err_redirect_fd

Passed

N/A

0.157141s

fork_out_redirect_path_err_redirect_path

Passed

N/A

0.157258s

status_coredump

Passed

N/A

0.293338s

status_exited

Passed

N/A

0.203724s

status_signaled

Passed

N/A

0.118837s

stream_init_capture

Passed

N/A

0.112302s

stream_init_connect

Passed

N/A

0.106323s

stream_init_inherit

Passed

N/A

0.239761s

stream_init_redirect_fd

Passed

N/A

0.122750s

stream_init_redirect_path

Passed

N/A

0.111202s

atf/atf-c/detail/sanity_test

1.142242s

inv

Passed

N/A

0.418552s

post

Passed

N/A

0.253544s

pre

Passed

N/A

0.190546s

unreachable

Passed

N/A

0.185746s

atf/atf-c/detail/text_test

1.142085s

for_each_word

Passed

N/A

0.172425s

format

Passed

N/A

0.086915s

format_ap

Passed

N/A

0.083208s

split

Passed

N/A

0.147832s

split_delims

Passed

N/A

0.220270s

to_bool

Passed

N/A

0.160469s

to_long

Passed

N/A

0.093192s

atf/atf-c/detail/user_test

0.700228s

euid

Passed

N/A

0.088096s

is_member_of_group

Passed

N/A

0.154563s

is_root

Passed

N/A

0.253176s

is_unprivileged

Passed

N/A

0.118222s

atf/atf-c/atf_c_test

4.077765s

include

Passed

N/A

4.025975s

atf/atf-c/build_test

4.774396s

c_o

Passed

N/A

0.284247s

cpp

Passed

N/A

0.137289s

cxx_o

Passed

N/A

0.154640s

equal_arrays

Passed

N/A

0.230602s

include

Passed

N/A

3.754684s

atf/atf-c/check_test

42.803614s

build_c_o

Passed

N/A

5.836571s

build_cpp

Passed

N/A

3.458738s

build_cxx_o

Passed

N/A

28.325028s

exec_array

Passed

N/A

0.282205s

exec_cleanup

Passed

N/A

0.356653s

exec_exitstatus

Passed

N/A

0.300569s

exec_stdout_stderr

Passed

N/A

0.289343s

exec_umask

Passed

N/A

0.097620s

exec_unknown

Passed

N/A

0.113116s

include

Passed

N/A

3.429462s

atf/atf-c/config_test

2.775662s

get

Passed

N/A

0.198318s

include

Passed

N/A

2.468636s

atf/atf-c/error_test

5.325052s

error_new

Passed

N/A

0.078686s

error_new_wo_memory

Passed

N/A

0.058243s

format

Passed

N/A

0.064402s

include

Passed

N/A

2.140369s

include_fwd

Passed

N/A

2.111316s

is_error

Passed

N/A

0.189614s

libc_format

Passed

N/A

0.101939s

libc_new

Passed

N/A

0.055113s

no_error

Passed

N/A

0.054621s

no_memory_format

Passed

N/A

0.054292s

no_memory_new

Passed

N/A

0.064450s

no_memory_twice

Passed

N/A

0.158680s

atf/atf-c/macros_test

18.446134s

check

Passed

N/A

0.169552s

check_eq

Passed

N/A

0.307493s

check_errno

Passed

N/A

0.292026s

check_match

Passed

N/A

0.223656s

check_streq

Passed

N/A

0.295825s

detect_unused_tests

Expected failure

PR 49187: Build of unused_test.c passed; unused test cases are not properly detected

5.904136s

include

Passed

N/A

2.472946s

msg_embedded_fmt

Passed

N/A

0.324579s

require

Passed

N/A

0.150161s

require_eq

Passed

N/A

0.211712s

require_errno

Passed

N/A

0.129240s

require_match

Passed

N/A

0.372022s

require_streq

Passed

N/A

0.379277s

use

Passed

N/A

6.912781s

atf/atf-c/tc_test

4.114551s

config

Passed

N/A

0.201544s

include

Passed

N/A

3.094117s

init

Passed

N/A

0.193652s

init_pack

Passed

N/A

0.282460s

vars

Passed

N/A

0.159656s

atf/atf-c/tp_test

3.076145s

getopt

Passed

N/A

0.087769s

include

Passed

N/A

2.902916s

atf/atf-c/utils_test

9.048837s

cat_file__empty

Passed

N/A

0.336104s

cat_file__no_newline_eof

Passed

N/A

0.162869s

cat_file__one_line

Passed

N/A

0.146704s

cat_file__several_lines

Passed

N/A

0.162715s

compare_file__empty__match

Passed

N/A

0.093870s

compare_file__empty__not_match

Passed

N/A

0.235333s

compare_file__long__match

Passed

N/A

0.164946s

compare_file__long__not_match

Passed

N/A

0.103869s

compare_file__short__match

Passed

N/A

0.079135s

compare_file__short__not_match

Passed

N/A

0.098214s

copy_file__empty

Passed

N/A

0.100345s

copy_file__some_contents

Passed

N/A

0.237650s

create_file

Passed

N/A

0.144686s

file_exists

Passed

N/A

0.087112s

fork

Passed

N/A

0.125595s

free_charpp__empty

Passed

N/A

0.102897s

free_charpp__some

Passed

N/A

0.096465s

grep_file

Passed

N/A

0.264801s

grep_string

Passed

N/A

0.168070s

include

Passed

N/A

3.384557s

readline__none

Passed

N/A

0.341510s

readline__some

Passed

N/A

0.171686s

redirect__other

Passed

N/A

0.102491s

redirect__stderr

Passed

N/A

0.223758s

redirect__stdout

Passed

N/A

0.090987s

wait__invalid_exitstatus

Passed

N/A

0.310901s

wait__invalid_stderr

Passed

N/A

0.185061s

wait__invalid_stdout

Passed

N/A

0.143462s

wait__ok

Passed

N/A

0.101441s

wait__save_stderr

Passed

N/A

0.139877s

wait__save_stdout

Passed

N/A

0.288655s

atf/atf-c/pkg_config_test

0.096502s

build

Skipped

Required program 'pkg-config' not found in the PATH

0.030151s

version

Skipped

Required program 'pkg-config' not found in the PATH

0.012581s

atf/atf-c++/detail/application_test

0.356243s

getopt

Passed

N/A

0.288649s

atf/atf-c++/detail/auto_array_test

2.722113s

auto_array_access

Passed

N/A

0.287471s

auto_array_assign

Passed

N/A

0.384005s

auto_array_assign_ref

Passed

N/A

0.178544s

auto_array_copy

Passed

N/A

0.382108s

auto_array_copy_ref

Passed

N/A

0.152614s

auto_array_get

Passed

N/A

0.212162s

auto_array_release

Passed

N/A

0.185543s

auto_array_reset

Passed

N/A

0.369063s

auto_array_scope

Passed

N/A

0.211720s

atf/atf-c++/detail/env_test

0.857537s

has_get

Passed

N/A

0.269231s

set

Passed

N/A

0.275858s

unset

Passed

N/A

0.173972s

atf/atf-c++/detail/exceptions_test

0.797585s

throw_atf_error_libc

Passed

N/A

0.255966s

throw_atf_error_no_memory

Passed

N/A

0.300357s

throw_atf_error_unknown

Passed

N/A

0.152463s

atf/atf-c++/detail/fs_test

4.021491s

directory_file_info

Passed

N/A

0.380722s

directory_names

Passed

N/A

0.233043s

directory_read

Passed

N/A

0.230829s

exists

Passed

N/A

0.170104s

file_info_perms

Passed

N/A

0.211615s

file_info_stat

Passed

N/A

0.169162s

is_executable

Passed

N/A

0.202188s

path_branch_path

Passed

N/A

0.148218s

path_compare_different

Passed

N/A

0.181222s

path_compare_equal

Passed

N/A

0.150457s

path_concat

Passed

N/A

0.188712s

path_is_absolute

Passed

N/A

0.151281s

path_is_root

Passed

N/A

0.099269s

path_leaf_name

Passed

N/A

0.192563s

path_normalize

Passed

N/A

0.145100s

path_op_less

Passed

N/A

0.196806s

path_to_absolute

Passed

N/A

0.150134s

remove

Passed

N/A

0.257326s

atf/atf-c++/detail/process_test

3.562647s

argv_array_assign

Passed

N/A

0.341225s

argv_array_copy

Passed

N/A

0.159466s

argv_array_exec_argv

Passed

N/A

0.424345s

argv_array_init_carray

Passed

N/A

0.152139s

argv_array_init_col

Passed

N/A

0.314412s

argv_array_init_empty

Passed

N/A

0.229728s

argv_array_init_varargs

Passed

N/A

0.301825s

argv_array_iter

Passed

N/A

0.267434s

exec_failure

Passed

N/A

0.523494s

exec_success

Passed

N/A

0.415677s

atf/atf-c++/detail/sanity_test

0.389636s

nothing

Passed

N/A

0.316737s

atf/atf-c++/detail/text_test

2.434078s

duplicate

Passed

N/A

0.313594s

join

Passed

N/A

0.128677s

match

Passed

N/A

0.280822s

split

Passed

N/A

0.143510s

split_delims

Passed

N/A

0.189847s

to_bool

Passed

N/A

0.194132s

to_bytes

Passed

N/A

0.260890s

to_string

Passed

N/A

0.185623s

to_type

Passed

N/A

0.274439s

trim

Passed

N/A

0.176961s

atf/atf-c++/atf_c++_test

26.484206s

include

Passed

N/A

26.429900s

atf/atf-c++/build_test

9.176696s

c_o

Passed

N/A

0.401647s

cpp

Passed

N/A

0.381691s

cxx_o

Passed

N/A

0.422358s

equal_argvs

Passed

N/A

0.247726s

include

Passed

N/A

7.505832s

atf/atf-c++/check_test

34.063862s

build_c_o

Passed

N/A

3.949432s

build_cpp

Passed

N/A

2.331114s

build_cxx_o

Passed

N/A

16.849379s

exec_cleanup

Passed

N/A

0.370805s

exec_exitstatus

Passed

N/A

0.329415s

exec_stdout_stderr

Passed

N/A

0.373719s

exec_unknown

Passed

N/A

0.257376s

include

Passed

N/A

9.321771s

atf/atf-c++/config_test

8.308384s

get

Passed

N/A

0.244864s

get_all

Passed

N/A

0.184346s

has

Passed

N/A

0.094133s

include

Passed

N/A

7.688386s

atf/atf-c++/macros_test

99.550822s

check_errno

Passed

N/A

0.369113s

detect_unused_tests

Expected failure

PR 49187: Build of unused_test.cpp passed; unused test cases are not properly detected

42.179541s

fail

Passed

N/A

0.272407s

include

Passed

N/A

19.616032s

pass

Passed

N/A

0.340457s

require

Passed

N/A

0.295833s

require_eq

Passed

N/A

0.241359s

require_errno

Passed

N/A

0.308802s

require_in

Passed

N/A

0.389102s

require_match

Failed

Test program received signal 11 (core dumped)

3.388819s

require_not_in

Passed

N/A

0.443622s

require_throw

Passed

N/A

0.433029s

require_throw_re

Passed

N/A

0.542177s

skip

Passed

N/A

0.184587s

use

Passed

N/A

30.115595s

atf/atf-c++/tests_test

8.536205s

atf_tp_writer

Passed

N/A

0.205272s

include

Passed

N/A

8.250817s

atf/atf-c++/utils_test

13.539090s

cat_file__empty

Passed

N/A

0.205796s

cat_file__no_newline_eof

Passed

N/A

0.222368s

cat_file__one_line

Passed

N/A

0.188907s

cat_file__several_lines

Passed

N/A

0.262511s

compare_file__empty__match

Passed

N/A

0.099186s

compare_file__empty__not_match

Passed

N/A

0.205187s

compare_file__long__match

Passed

N/A

0.138315s

compare_file__long__not_match

Passed

N/A

0.205854s

compare_file__short__match

Passed

N/A

0.135826s

compare_file__short__not_match

Passed

N/A

0.186948s

copy_file__empty

Passed

N/A

0.147991s

copy_file__some_contents

Passed

N/A

0.192755s

create_file

Passed

N/A

0.156149s

file_exists

Passed

N/A

0.189504s

fork

Passed

N/A

0.182301s

grep_collection__set

Passed

N/A

0.208555s

grep_collection__vector

Passed

N/A

0.158434s

grep_file

Passed

N/A

0.227736s

grep_string

Passed

N/A

0.155842s

include

Passed

N/A

6.941607s

redirect__other

Passed

N/A

0.280701s

redirect__stderr

Passed

N/A

0.291185s

redirect__stdout

Passed

N/A

0.191346s

wait__invalid_exitstatus

Passed

N/A

0.256888s

wait__invalid_stderr

Passed

N/A

0.212614s

wait__invalid_stdout

Passed

N/A

0.233085s

wait__ok

Passed

N/A

0.202312s

wait__save_stderr

Passed

N/A

0.375473s

wait__save_stdout

Passed

N/A

0.326885s

atf/atf-c++/pkg_config_test

0.073961s

build

Skipped

Required program 'pkg-config' not found in the PATH

0.017633s

version

Skipped

Required program 'pkg-config' not found in the PATH

0.013942s

atf/atf-sh/atf-check_test

73.410081s

eflag_empty

Passed

N/A

1.941306s

eflag_file

Passed

N/A

2.675653s

eflag_ignore

Passed

N/A

1.463660s

eflag_inline

Passed

N/A

5.691869s

eflag_match

Passed

N/A

3.055616s

eflag_multiple

Passed

N/A

2.671305s

eflag_negated

Passed

N/A

3.719662s

eflag_save

Passed

N/A

1.752089s

invalid_umask

Passed

N/A

1.760264s

oflag_empty

Passed

N/A

2.422380s

oflag_file

Passed

N/A

3.723329s

oflag_ignore

Passed

N/A

2.029269s

oflag_inline

Passed

N/A

6.052888s

oflag_match

Passed

N/A

3.808467s

oflag_multiple

Passed

N/A

3.306623s

oflag_negated

Passed

N/A

3.402527s

oflag_save

Passed

N/A

1.582905s

sflag_eq_ne

Passed

N/A

4.926509s

sflag_exit

Passed

N/A

6.291740s

sflag_ignore

Passed

N/A

2.381838s

sflag_signal

Passed

N/A

4.471708s

stdin

Passed

N/A

1.303314s

xflag

Passed

N/A

2.092026s

atf/atf-sh/atf_check_test

40.908796s

equal

Passed

N/A

6.513466s

experr_mismatch

Passed

N/A

3.378639s

expout_mismatch

Passed

N/A

3.094459s

flush_stdout_on_timeout

Passed

N/A

21.032545s

info_ok

Passed

N/A

2.902579s

null_stderr

Failed

atf-check failed; see the output of the test for details

1.482150s

null_stdout

Passed

N/A

2.062174s

atf/atf-sh/config_test

6.791283s

get

Passed

N/A

2.435178s

has

Passed

N/A

4.274801s

atf/atf-sh/integration_test

4.163731s

arguments

Passed

N/A

1.823380s

missing_script

Passed

N/A

1.104078s

no_args

Passed

N/A

1.051982s

atf/atf-sh/normalize_test

1.404785s

main

Passed

N/A

1.367589s

atf/atf-sh/tc_test

4.368575s

default_status

Passed

N/A

3.114573s

missing_body

Passed

N/A

1.190189s

atf/atf-sh/tp_test

1.591599s

srcdir

Passed

N/A

1.483968s

atf/test-programs/config_test

9.594824s

vflag

Passed

N/A

9.552449s

atf/test-programs/expect_test

49.485091s

expect_death

Passed

N/A

8.172756s

expect_exit

Passed

N/A

10.307813s

expect_fail

Passed

N/A

9.451947s

expect_pass

Failed

atf-check failed; see the output of the test for details

6.555287s

expect_signal

Passed

N/A

10.868775s

expect_timeout

Passed

N/A

3.946488s

atf/test-programs/meta_data_test

17.151504s

no_descr

Passed

N/A

8.570507s

no_head

Passed

N/A

8.456762s

atf/test-programs/result_test

15.430566s

atf_run_warnings

Passed

N/A

1.720188s

result_exception

Passed

N/A

0.971113s

result_on_stdout

Passed

N/A

4.105190s

result_to_file

Passed

N/A

6.369541s

result_to_file_fail

Passed

N/A

2.049438s

atf/test-programs/srcdir_test

24.504540s

default

Passed

N/A

4.291900s

libtool

Passed

N/A

4.482900s

relative

Passed

N/A

13.495239s

sflag

Failed

atf-check failed; see the output of the test for details

2.082583s

atf/tools/application_test

0.246267s

getopt

Passed

N/A

0.180890s

atf/tools/atffile_test

4.066368s

atffile_1

Passed

N/A

0.221328s

atffile_2

Passed

N/A

0.167589s

atffile_3

Passed

N/A

0.201279s

atffile_4

Passed

N/A

0.150937s

atffile_5

Passed

N/A

0.218895s

atffile_50

Passed

N/A

0.319074s

atffile_51

Passed

N/A

0.260180s

atffile_52

Passed

N/A

0.252762s

atffile_53

Passed

N/A

0.303379s

atffile_54

Passed

N/A

0.211741s

atffile_6

Passed

N/A

0.188697s

atffile_getters

Passed

N/A

0.137900s

read_missing_test_program

Passed

N/A

0.265533s

read_missing_test_suite

Passed

N/A

0.300374s

read_ok_simple

Passed

N/A

0.172810s

read_ok_some_globs

Passed

N/A

0.226492s

atf/tools/auto_array_test

1.828955s

auto_array_access

Passed

N/A

0.188000s

auto_array_assign

Passed

N/A

0.203327s

auto_array_assign_ref

Passed

N/A

0.158537s

auto_array_copy

Passed

N/A

0.198253s

auto_array_copy_ref

Passed

N/A

0.161735s

auto_array_get

Passed

N/A

0.201834s

auto_array_release

Passed

N/A

0.163097s

auto_array_reset

Passed

N/A

0.203921s

auto_array_scope

Passed

N/A

0.147937s

atf/tools/config_file_test

3.094453s

config_1

Passed

N/A

0.162576s

config_2

Passed

N/A

0.195266s

config_3

Passed

N/A

0.137009s

config_4

Passed

N/A

0.189383s

config_50

Passed

N/A

0.290487s

config_51

Passed

N/A

0.211162s

config_52

Passed

N/A

0.242616s

config_53

Passed

N/A

0.275403s

config_54

Passed

N/A

0.248408s

merge_configs_both_empty

Passed

N/A

0.173962s

merge_configs_lower_empty

Passed

N/A

0.165565s

merge_configs_mixed

Passed

N/A

0.100402s

merge_configs_upper_empty

Passed

N/A

0.192450s

read_config_files_none

Passed

N/A

0.145587s

atf/tools/config_test

0.544317s

get

Passed

N/A

0.204123s

get_all

Passed

N/A

0.183986s

has

Passed

N/A

0.089926s

atf/tools/env_test

0.539466s

has_get

Passed

N/A

0.142220s

set

Passed

N/A

0.191475s

unset

Passed

N/A

0.128662s

atf/tools/expand_test

1.143219s

expand_glob_base

Passed

N/A

0.154214s

expand_glob_tps

Passed

N/A

0.203901s

is_glob

Passed

N/A

0.088714s

matches_glob_plain

Passed

N/A

0.179352s

matches_glob_question

Passed

N/A

0.141050s

matches_glob_star

Passed

N/A

0.186909s

atf/tools/fs_test

6.408338s

change_directory

Passed

N/A

0.283576s

cleanup

Passed

N/A

0.297141s

cleanup_eacces_on_root

Passed

N/A

0.214015s

cleanup_eacces_on_subdir

Passed

N/A

0.275702s

directory_file_info

Passed

N/A

0.204473s

directory_names

Passed

N/A

0.155365s

directory_read

Passed

N/A

0.200476s

exists

Passed

N/A

0.292092s

file_info_perms

Passed

N/A

0.159512s

file_info_stat

Passed

N/A

0.191219s

get_current_dir

Passed

N/A

0.159164s

is_executable

Passed

N/A

0.260446s

path_branch_path

Passed

N/A

0.151652s

path_compare_different

Passed

N/A

0.214612s

path_compare_equal

Passed

N/A

0.607668s

path_concat

Passed

N/A

0.260722s

path_is_absolute

Passed

N/A

0.193507s

path_is_root

Passed

N/A

0.157159s

path_leaf_name

Passed

N/A

0.184733s

path_normalize

Passed

N/A

0.151407s

path_op_less

Passed

N/A

0.196993s

path_to_absolute

Passed

N/A

0.157735s

remove

Passed

N/A

0.307046s

temp_dir_raii

Passed

N/A

0.314040s

atf/tools/io_test

30.325636s

file_handle_copy

Passed

N/A

0.246137s

file_handle_ctor

Passed

N/A

0.104887s

file_handle_get

Passed

N/A

0.209978s

file_handle_posix_remap

Passed

N/A

0.147235s

muxer_large_buffer

Passed

N/A

21.192744s

muxer_small_buffer

Passed

N/A

6.973366s

pistream

Passed

N/A

0.208466s

systembuf_long_read

Passed

N/A

0.279984s

systembuf_long_write

Passed

N/A

0.301114s

systembuf_short_read

Passed

N/A

0.159588s

systembuf_short_write

Passed

N/A

0.209388s

atf/tools/parser_test

5.483738s

headers_1

Passed

N/A

0.304051s

headers_10

Passed

N/A

0.274718s

headers_11

Passed

N/A

0.209604s

headers_12

Passed

N/A

0.261800s

headers_2

Passed

N/A

0.277167s

headers_3

Passed

N/A

0.214198s

headers_4

Passed

N/A

0.241568s

headers_5

Passed

N/A

0.211693s

headers_6

Passed

N/A

0.239126s

headers_7

Passed

N/A

0.204231s

headers_8

Passed

N/A

0.280999s

headers_9

Passed

N/A

0.251871s

parse_error_to_string

Passed

N/A

0.150499s

parse_errors_what

Passed

N/A

0.200972s

token_getters

Passed

N/A

0.144027s

tokenizer_delims_nows

Passed

N/A

0.189300s

tokenizer_delims_ws

Passed

N/A

0.150483s

tokenizer_keywords_nows

Passed

N/A

0.185973s

tokenizer_keywords_ws

Passed

N/A

0.159884s

tokenizer_minimal_nows

Passed

N/A

0.185208s

tokenizer_minimal_ws

Passed

N/A

0.164891s

tokenizer_quotes_nows

Passed

N/A

0.180360s

tokenizer_quotes_ws

Passed

N/A

0.157027s

atf/tools/process_test

1.989017s

argv_array_assign

Passed

N/A

0.149315s

argv_array_copy

Passed

N/A

0.220625s

argv_array_exec_argv

Passed

N/A

0.100965s

argv_array_init_carray

Passed

N/A

0.179403s

argv_array_init_col

Passed

N/A

0.140923s

argv_array_init_empty

Passed

N/A

0.170986s

argv_array_init_varargs

Passed

N/A

0.148443s

argv_array_iter

Passed

N/A

0.183817s

exec_failure

Passed

N/A

0.182727s

exec_success

Passed

N/A

0.225604s

atf/tools/reader_test

6.642578s

tps_1

Passed

N/A

0.219910s

tps_2

Passed

N/A

0.203091s

tps_3

Passed

N/A

0.174278s

tps_4

Passed

N/A

0.226430s

tps_5

Passed

N/A

0.232380s

tps_50

Passed

N/A

0.230799s

tps_51

Passed

N/A

0.274531s

tps_52

Passed

N/A

0.301373s

tps_53

Passed

N/A

0.220515s

tps_54

Passed

N/A

0.274948s

tps_55

Passed

N/A

0.329844s

tps_56

Passed

N/A

0.305386s

tps_57

Passed

N/A

0.262205s

tps_58

Passed

N/A

0.275021s

tps_59

Passed

N/A

0.302936s

tps_6

Passed

N/A

0.183899s

tps_60

Passed

N/A

0.266626s

tps_61

Passed

N/A

0.311015s

tps_62

Passed

N/A

0.260080s

tps_63

Passed

N/A

0.264322s

tps_64

Passed

N/A

0.274070s

tps_65

Passed

N/A

0.244051s

tps_66

Passed

N/A

0.257443s

atf/tools/requirements_test

6.904793s

require_arch_many_fail

Passed

N/A

0.244660s

require_arch_many_ok

Passed

N/A

0.182404s

require_arch_one_fail

Passed

N/A

0.155612s

require_arch_one_ok

Passed

N/A

0.182375s

require_config_many_fail

Passed

N/A

0.154276s

require_config_many_ok

Passed

N/A

0.195560s

require_config_one_fail

Passed

N/A

0.158991s

require_config_one_ok

Passed

N/A

0.101704s

require_files_many_fail

Passed

N/A

0.286188s

require_files_many_missing

Passed

N/A

0.306477s

require_files_many_ok

Passed

N/A

0.157112s

require_files_one_fail

Passed

N/A

0.258808s

require_files_one_missing

Passed

N/A

0.223837s

require_files_one_ok

Passed

N/A

0.182257s

require_machine_many_fail

Passed

N/A

0.174491s

require_machine_many_ok

Passed

N/A

0.182884s

require_machine_one_fail

Passed

N/A

0.168276s

require_machine_one_ok

Passed

N/A

0.172813s

require_memory_fail

Passed

N/A

0.206431s

require_memory_not_enough

Passed

N/A

0.194900s

require_memory_ok

Passed

N/A

0.145876s

require_progs_many_fail

Passed

N/A

0.241443s

require_progs_many_missing

Passed

N/A

0.217231s

require_progs_many_ok

Passed

N/A

0.256593s

require_progs_one_fail

Passed

N/A

0.313651s

require_progs_one_missing

Passed

N/A

0.212370s

require_progs_one_ok

Passed

N/A

0.243605s

require_user_fail

Passed

N/A

0.209144s

require_user_root

Passed

N/A

0.193852s

require_user_unprivileged

Passed

N/A

0.168326s

atf/tools/signals_test

0.987639s

reset

Passed

N/A

0.161077s

signal_holder_destructor

Passed

N/A

0.185359s

signal_holder_preserve

Passed

N/A

0.123066s

signal_holder_process

Passed

N/A

0.142108s

signal_programmer_preserve

Passed

N/A

0.154566s

signal_programmer_program

Passed

N/A

0.096566s

atf/tools/test_program_test

9.569542s

atf_tps_writer

Passed

N/A

0.402736s

get_metadata_bad

Passed

N/A

0.317384s

get_metadata_several_tcs

Passed

N/A

0.282145s

get_metadata_zero_tcs

Passed

N/A

0.328186s

parse_test_case_result_expected_death

Passed

N/A

0.284881s

parse_test_case_result_expected_exit

Passed

N/A

0.266121s

parse_test_case_result_expected_failure

Passed

N/A

0.250892s

parse_test_case_result_expected_signal

Passed

N/A

0.213306s

parse_test_case_result_expected_timeout

Passed

N/A

0.243905s

parse_test_case_result_failed

Passed

N/A

0.220292s

parse_test_case_result_passed

Passed

N/A

0.267657s

parse_test_case_result_skipped

Passed

N/A

0.213294s

parse_test_case_result_unknown

Passed

N/A

0.267543s

read_test_case_result_empty_file

Passed

N/A

0.283688s

read_test_case_result_failed

Passed

N/A

0.189642s

read_test_case_result_invalid

Passed

N/A

0.259549s

read_test_case_result_multiline

Passed

N/A

0.167429s

read_test_case_result_no_file

Passed

N/A

0.256851s

read_test_case_result_skipped

Passed

N/A

0.167906s

tp_1

Passed

N/A

0.208058s

tp_2

Passed

N/A

0.235221s

tp_3

Passed

N/A

0.178474s

tp_4

Passed

N/A

0.203926s

tp_50

Passed

N/A

0.225085s

tp_51

Passed

N/A

0.261412s

tp_52

Passed

N/A

0.256794s

tp_53

Passed

N/A

0.228301s

tp_54

Passed

N/A

0.261801s

tp_55

Passed

N/A

0.285152s

tp_56

Passed

N/A

0.257091s

tp_57

Passed

N/A

0.275835s

tp_58

Passed

N/A

0.312472s

tp_59

Passed

N/A

0.215078s

tp_60

Passed

N/A

0.255170s

atf/tools/text_test

2.332984s

duplicate

Passed

N/A

0.203935s

join

Passed

N/A

0.098023s

match

Passed

N/A

0.294866s

split

Passed

N/A

0.184751s

split_delims

Passed

N/A

0.141681s

to_bool

Passed

N/A

0.272759s

to_bytes

Passed

N/A

0.198870s

to_string

Passed

N/A

0.183318s

to_type

Passed

N/A

0.241545s

trim

Passed

N/A

0.201306s

atf/tools/ui_test

1.579781s

paragraphs

Passed

N/A

0.316611s

w_tag_col

Passed

N/A

0.224140s

w_tag_no_repeat

Passed

N/A

0.194140s

w_tag_repeat

Passed

N/A

0.223838s

wo_tag

Passed

N/A

0.197581s

wo_tag_col

Passed

N/A

0.223000s

atf/tools/user_test

0.820099s

euid

Passed

N/A

0.227232s

is_member_of_group

Passed

N/A

0.156679s

is_root

Passed

N/A

0.186551s

is_unprivileged

Passed

N/A

0.144433s

atf/tools/atf-config_test

70.768081s

list_all

Passed

N/A

4.704463s

override_env

Failed

atf-check failed; see the output of the test for details

23.407119s

query_mixture

Passed

N/A

11.681001s

query_multiple

Passed

N/A

1.217077s

query_one

Failed

atf-check failed; see the output of the test for details

7.588552s

query_one_terse

Passed

N/A

20.953426s

query_unknown

Passed

N/A

1.004182s

atf/tools/atf-report_test

39.045215s

default

Passed

N/A

4.143632s

expect

Passed

N/A

8.708886s

oflag

Passed

N/A

9.003337s

output_csv

Passed

N/A

4.382372s

output_ticker

Passed

N/A

4.251398s

output_xml

Passed

N/A

4.220745s

output_xml_space

Passed

N/A

2.800044s

too_many_args

Passed

N/A

1.173965s

atf/tools/atf-run_test

358.103911s

atffile

Passed

N/A

13.873568s

atffile_recursive

Passed

N/A

11.090037s

broken_results

Passed

N/A

6.224794s

broken_tp_list

Passed

N/A

5.312145s

cleanup_curdir

Passed

N/A

6.543482s

cleanup_fail

Passed

N/A

5.541591s

cleanup_mount

Passed

N/A

8.465432s

cleanup_pass

Passed

N/A

6.317924s

cleanup_signal

Passed

N/A

1.014774s

cleanup_skip

Passed

N/A

4.515439s

cleanup_symlink

Passed

N/A

5.950930s

config

Passed

N/A

15.820436s

exit_codes

Passed

N/A

4.148816s

expect

Failed

atf-check failed; see the output of the test for details

9.939067s

fds

Passed

N/A

4.367066s

hooks

Passed

N/A

15.982766s

ignore_deprecated_use_fs

Passed

N/A

3.672409s

isolation_env

Passed

N/A

7.559898s

isolation_home

Passed

N/A

4.762605s

isolation_stdin

Passed

N/A

3.659200s

isolation_umask

Passed

N/A

3.659006s

missing_results

Passed

N/A

4.835947s

mux_streams

Passed

N/A

43.357038s

no_warnings

Passed

N/A

5.170437s

require_arch

Passed

N/A

29.614314s

require_config

Passed

N/A

9.857786s

require_files

Passed

N/A

16.678901s

require_machine

Passed

N/A

30.583193s

require_progs

Passed

N/A

15.854847s

require_user_bad

Passed

N/A

4.708122s

require_user_root

Passed

N/A

5.712278s

require_user_unprivileged

Passed

N/A

4.857792s

signaled

Passed

N/A

4.185765s

timeout

Passed

N/A

8.167215s

timeout_forkexit

Passed

N/A

4.363157s

vflag

Failed

atf-check failed; see the output of the test for details

14.660784s

zero_tcs

Passed

N/A

4.912790s

Failed test cases summary

Test case

Result

Reason

Duration

bin/expr/t_expr

13.741107s

multiply

Failed

Test program received signal 11 (core dumped)

0.082862s

bin/sh/dotcmd/t_dotcmd

294.963921s

for_return_func

Failed

Test case exited normally but failed to create the results file: Failed to open /tmp/atf-run.7gBRGI/tcr

1.361886s

subshell_continue_file

Failed

Test program received signal 11 (core dumped)

0.083744s

while_continue_compound

Failed

atf-check failed; see the output of the test for details

1.262085s

bin/sh/t_cmdsub

60.853682s

a_basic_cmdsub

Failed

Test case exited normally but failed to create the results file: Failed to open /tmp/atf-run.XJW778/tcr

0.732378s

g_redirect_in_backticks

Failed

Test case exited normally but failed to create the results file: Failed to open /tmp/atf-run.XJW778/tcr

0.574037s

bin/sh/t_exit

18.291969s

subshell_exit

Failed

atf-check failed; see the output of the test for details

3.419095s

bin/sh/t_expand

18.371614s

arithmetic

Failed

Test program received signal 11 (core dumped)

0.198413s

bin/sh/t_here

80.684865s

end_markers

Failed

Test end_markers: 1 subtests (of 236) failed - see stderr

61.212019s

incomplete

Failed

Test program received signal 11 (core dumped)

0.149524s

bin/sh/t_option

43.202371s

Option_switching

Failed

atf-check failed; see the output of the test for details

8.193843s

restore_local_opts

Failed

Test case exited normally but failed to create the results file: Failed to open /tmp/atf-run.iqtO1M/tcr

0.727903s

bin/sh/t_redir

39.629555s

local_redirections

Failed

Test case exited normally but failed to create the results file: Failed to open /tmp/atf-run.V88nE1/tcr

0.796236s

validate_fn_redirects

Failed

atf-check failed; see the output of the test for details

0.844373s

bin/sh/t_wait

35.503485s

basic_wait

Failed

atf-check failed; see the output of the test for details

1.359736s

dev/raidframe/t_raid

97.398231s

raid5_compfail

Failed

atf-check failed; see the output of the test for details

20.633270s

dev/sysmon/t_swwdog

6.889999s

disarm

Failed

/tmp/bracket/build/2016.06.15.04.33.52-i386/src/tests/dev/sysmon/t_swwdog.c:84: tcount != max

1.695955s

dev/usb/t_hid

3.788972s

khid

Failed

Test program received signal 11 (core dumped)

3.219176s

kernel/t_umountstress

22.075038s

fileop

Failed

File operation failed

6.866388s

mountlist

Failed

Mountlist operation failed

15.045124s

lib/libc/c063/t_openat

3.352927s

openat_fdcwd

Failed

Test program received signal 11 (core dumped)

2.542829s

lib/libc/db/t_db

3240.124422s

small_hash

Failed

Test case exited normally but failed to create the results file: Failed to open /tmp/atf-run.LoZeZQ/tcr

0.970082s

lib/libc/gen/t_sleep

211.550390s

kevent

Failed

/tmp/bracket/build/2016.06.15.04.33.52-i386/src/tests/lib/libc/gen/t_sleep.c:180: kevent: KEVNT_TIMEOUT did not cause EVFILT_TIMER event

54.344529s

lib/libc/regex/t_regex

39.463658s

backref

Failed

atf-check failed; see the output of the test for details

1.103817s

lib/libc/rpc/t_rpc

4.005525s

tcp

Failed

/tmp/bracket/build/2016.06.15.04.33.52-i386/src/tests/lib/libc/rpc/t_rpc.c:179: Cannot create server 1

0.371286s

tcp_poll

Failed

/tmp/bracket/build/2016.06.15.04.33.52-i386/src/tests/lib/libc/rpc/t_rpc.c:179: Cannot create server 1

0.195344s

udp

Failed

/tmp/bracket/build/2016.06.15.04.33.52-i386/src/tests/lib/libc/rpc/t_rpc.c:179: Cannot create server 1

0.145138s

udp_poll

Failed

/tmp/bracket/build/2016.06.15.04.33.52-i386/src/tests/lib/libc/rpc/t_rpc.c:179: Cannot create server 1

0.143274s

lib/libc/sys/t_getpid

2.594342s

getpid_thread

Failed

Test program received signal 11 (core dumped)

2.347820s

lib/libevent/t_event

856.047674s

kqueue

Failed

check report

285.354504s

poll

Failed

check report

288.546644s

select

Failed

check report

281.867545s

lib/libm/t_pow

2.180594s

pow_zero_x

Failed

1 checks failed; see output for more details

0.063004s

powf_zero_x

Failed

1 checks failed; see output for more details

0.104519s

lib/libobjc/t_threads

604.939061s

thread_callback

Failed

Test case timed out after 300 seconds

604.819076s

lib/libusbhid/t_usbhid

0.858932s

check_hid_get_data

Failed

4 checks failed; see output for more details

0.217575s

lib/librumphijack/t_sh

9.122298s

redirect

Failed

atf-check failed; see the output of the test for details

4.336309s

runscript

Failed

atf-check failed; see the output of the test for details

4.640060s

lib/librumphijack/t_tcpip

32.668396s

nfs

Failed

atf-check failed; see the output of the test for details

9.430994s

nfs_autoload

Failed

atf-check failed; see the output of the test for details

8.537476s

net/net/t_forwarding

184.256733s

basic

Failed

Test case exited normally but failed to create the results file: Failed to open /tmp/atf-run.ErA1U9/tcr

2.083336s

misc

Failed

atf-check failed; see the output of the test for details

50.490444s

net/net/t_ipaddress

29.009570s

ipaddr_same_address6

Failed

atf-check failed; see the output of the test for details

1.496240s

net/net/t_ipv6address

64.515787s

linklocal

Failed

atf-check failed; see the output of the test for details

31.349964s

net/net/t_ipv6_lifetime

60.078299s

basic

Failed

atf-check failed; see the output of the test for details

59.957905s

net/arp/t_arp

216.943157s

command

Failed

atf-check failed; see the output of the test for details

9.408219s

proxy_arp_pubproxy

Failed

atf-check failed; see the output of the test for details

6.795094s

net/if/t_ifconf

12.758346s

basic

Failed

atf-check failed; see the output of the test for details

12.642972s

net/if_bridge/t_bridge

252.345691s

basic

Failed

atf-check failed; see the output of the test for details

17.497538s

member_ip

Failed

atf-check failed; see the output of the test for details

47.056298s

net/if_gif/t_gif

471.989539s

basicipv4overipv6

Failed

atf-check failed; see the output of the test for details

12.562625s

basicipv6overipv6

Failed

atf-check failed; see the output of the test for details

15.554367s

ioctlipv4overipv6

Failed

atf-check failed; see the output of the test for details

40.919521s

recursiveipv6overipv6

Failed

Test program received signal 11 (core dumped)

1.581225s

net/mcast/t_mcast

52.433047s

mcast_unconninet4

Failed

Test case exited normally but failed to create the results file: Failed to open /tmp/atf-run.BmcVJG/tcr

1.089681s

net/mpls/t_mpls_fw64

76.252640s

mplsfw64_expl

Failed

atf-check failed; see the output of the test for details

33.058351s

net/mpls/t_rfc4182

13.608752s

rfc4182

Failed

atf-check failed; see the output of the test for details

13.538417s

net/ndp/t_ndp

195.820040s

command

Failed

atf-check failed; see the output of the test for details

27.612648s

net/ndp/t_ra

33.420540s

basic

Failed

atf-check failed; see the output of the test for details

33.307976s

net/route/t_route

45.007155s

command_get

Failed

atf-check failed; see the output of the test for details

23.556079s

command_get6

Failed

atf-check failed; see the output of the test for details

5.879445s

sbin/fsck_ffs/t_enable_quotas

58.402119s

corrupt_be_2

Failed

Test program received signal 11 (core dumped)

0.167912s

sbin/fsck_ffs/t_check_quotas

251.908640s

expand2_list_be_1

Failed

atf-check failed; see the output of the test for details

45.993784s

sbin/gpt/t_gpt

49.214121s

bootable_2part

Failed

atf-check failed; see the output of the test for details

3.333372s

sbin/resize_ffs/t_grow

226.410206s

grow_16M_v1_16384

Failed

atf-check failed; see the output of the test for details

56.198952s

sbin/resize_ffs/t_grow_swapped

201.542076s

grow_16M_v1_4096

Failed

atf-check failed; see the output of the test for details

73.574547s

sbin/resize_ffs/t_shrink_swapped

156.527808s

shrink_24M_16M_v0_4096

Failed

atf-check failed; see the output of the test for details

64.885356s

shrink_24M_16M_v1_8192

Failed

atf-check failed; see the output of the test for details

44.035208s

sbin/sysctl/t_perm

130.147173s

sysctl_kern

Failed

atf-check failed; see the output of the test for details

10.554409s

sysctl_net

Failed

atf-check failed; see the output of the test for details

44.534020s

sysctl_vfs

Failed

atf-check failed; see the output of the test for details

11.000971s

sysctl_vm

Failed

atf-check failed; see the output of the test for details

2.441700s

sys/net/t_print

0.239992s

sdl_print

Failed

/tmp/bracket/build/2016.06.15.04.33.52-i386/src/tests/sys/net/t_print.c:151: buf != res (link#3 != [/0#]:3)

0.049188s

usr.bin/awk/t_awk

23.473084s

string1

Failed

atf-check failed; see the output of the test for details

0.839645s

usr.bin/config/t_config

13.409159s

min

Failed

atf-check failed; see the output of the test for details

1.172297s

usr.bin/grep/t_grep

19.726402s

recurse

Failed

Test case exited normally but failed to create the results file: Failed to open /tmp/atf-run.Pr8qtz/tcr

0.773927s

zgrep

Failed

Test case exited normally but failed to create the results file: Failed to open /tmp/atf-run.Pr8qtz/tcr

0.681628s

usr.bin/ld/t_script

43.918357s

order_merge

Failed

atf-check failed; see the output of the test for details

9.145544s

usr.bin/make/t_make

225.949972s

forloop

Failed

Test case exited normally but failed to create the results file: Failed to open /tmp/atf-run.j6MAIw/tcr

1.685557s

usr.bin/nbperf/t_nbperf

260.394311s

bdz

Failed

atf-check failed; see the output of the test for details

72.085535s

chm3

Failed

atf-check failed; see the output of the test for details

67.203838s

usr.bin/netpgpverify/t_netpgpverify

14.304651s

netpgpverify_testset_1_rsa_signatures

Failed

Test case exited normally but failed to create the results file: Failed to open /tmp/atf-run.XJUL5Q/tcr

3.242216s

usr.bin/sort/t_sort

74.252763s

bflag

Failed

Test program received signal 11 (core dumped)

0.092912s

long_file

Failed

atf-check failed; see the output of the test for details

4.555582s

tflag_alphabetic

Failed

Test program received signal 11 (core dumped)

0.350553s

fs/ffs/t_getquota

84.824618s

get_be_2_both

Failed

atf-check failed; see the output of the test for details

5.895757s

get_le_2_group

Failed

atf-check failed; see the output of the test for details

4.871858s

fs/ffs/t_setquota

403.274861s

set_new_be_1_group

Failed

Test case exited normally but failed to create the results file: Failed to open /tmp/atf-run.64ZmXT/tcr

2.577311s

fs/ffs/t_quotalimit

249.087986s

herit_defq_le_1_user

Failed

atf-check failed; see the output of the test for details

12.452529s

fs/ffs/t_miscquota

236.601046s

psnapshot_unconf_user

Failed

atf-check failed; see the output of the test for details

14.418679s

fs/psshfs/t_psshfs

46.797117s

ls

Failed

atf-check failed; see the output of the test for details

7.357309s

fs/tmpfs/t_rmdir

30.979128s

single

Failed

atf-check failed; see the output of the test for details

1.299170s

fs/tmpfs/t_vnode_leak

0.856221s

main

Failed

Test program received signal 11 (core dumped)

0.793596s

fs/vfs/t_full

92.292552s

p2k_ffs_fillfs

Failed

newfs failed: No such file or directory

2.023287s

fs/vfs/t_io

301.268705s

ffs_wrrd_after_unlink

Failed

Test program received signal 11 (core dumped)

1.168549s

msdosfs_holywrite

Failed

newfs failed: Undefined error: 0

0.409344s

puffs_overwrite_trunc

Failed

child died

0.436277s

fs/vfs/t_union

76.377293s

nfs_whiteout

Failed

child died

0.655495s

fs/vfs/t_vfsops

204.946206s

ext2fs_tstatvfs

Failed

Test program received signal 11 (core dumped)

6.253702s

udf_tfilehandle

Failed

newfs failed: Undefined error: 0

0.598671s

fs/vfs/t_vnops

1328.454923s

nfs_lstat_symlink

Failed

Test program received signal 11 (core dumped)

6.410587s

rump/rumpnet/t_shmif

179.576632s

crossping

Failed

atf-check failed; see the output of the test for details

179.430926s

modules/t_modload

23.885990s

iflag

Failed

atf-check failed; see the output of the test for details

3.233531s

crypto/libcrypto/t_ciphers

47.597880s

bf

Failed

Test case exited normally but failed to create the results file: Failed to open /tmp/atf-run.tVy7US/tcr

0.593868s

ipf/t_filter_exec

138.883622s

f10

Failed

atf-check failed; see the output of the test for details

10.870732s

f5

Failed

atf-check failed; see the output of the test for details

3.842559s

ipf/t_filter_parse

36.401501s

i2

Failed

atf-check failed; see the output of the test for details

1.819616s

ipf/t_logging

3.406998s

l1

Failed

atf-check failed; see the output of the test for details

3.336839s

ipf/t_nat_exec

115.367415s

n1

Failed

atf-check failed; see the output of the test for details

0.988136s

n102

Failed

Test input file missing

0.867686s

n6

Failed

atf-check failed; see the output of the test for details

2.445500s

ipf/t_nat_parse

32.204472s

in4

Failed

atf-check failed; see the output of the test for details

1.262588s

share/mk/t_prog

28.542172s

defaults__build_and_install

Failed

atf-check failed; see the output of the test for details

12.179027s

share/mk/t_test

95.600519s

one_c

Failed

atf-check failed; see the output of the test for details

21.150415s

atf/atf-c++/macros_test

99.550822s

require_match

Failed

Test program received signal 11 (core dumped)

3.388819s

atf/atf-sh/atf_check_test

40.908796s

null_stderr

Failed

atf-check failed; see the output of the test for details

1.482150s

atf/test-programs/expect_test

49.485091s

expect_pass

Failed

atf-check failed; see the output of the test for details

6.555287s

atf/test-programs/srcdir_test

24.504540s

sflag

Failed

atf-check failed; see the output of the test for details

2.082583s

atf/tools/atf-config_test

70.768081s

override_env

Failed

atf-check failed; see the output of the test for details

23.407119s

query_one

Failed

atf-check failed; see the output of the test for details

7.588552s

atf/tools/atf-run_test

358.103911s

expect

Failed

atf-check failed; see the output of the test for details

9.939067s

vflag

Failed

atf-check failed; see the output of the test for details

14.660784s

Expected failures summary

Test case

Result

Reason

Duration

include/t_errno

0.103030s

errno_constants

Expected failure

PR standards/44921: 2 checks failed as expected; see output for more details

0.083699s

include/t_netdb

0.107227s

netdb_constants

Expected failure

PR standards/44777: 2 checks failed as expected; see output for more details

0.089332s

lib/libc/c063/t_fexecve

0.339988s

fexecve

Expected failure

fexecve not implemented: /tmp/bracket/build/2016.06.15.04.33.52-i386/src/tests/lib/libc/c063/t_fexecve.c:85: access("test", F_OK) == 0 not met

0.254971s

lib/libc/gen/t_fpsetmask

1.287687s

fpsetmask_masked_double

Expected failure

PR misc/44767: 3 checks failed as expected; see output for more details

0.265062s

fpsetmask_masked_float

Expected failure

PR misc/44767: 3 checks failed as expected; see output for more details

0.174565s

fpsetmask_masked_long_double

Expected failure

PR misc/44767: 3 checks failed as expected; see output for more details

0.104911s

fpsetmask_unmasked_double

Expected failure

PR misc/44767: 8 checks failed as expected; see output for more details

0.117344s

fpsetmask_unmasked_float

Expected failure

PR misc/44767: 8 checks failed as expected; see output for more details

0.274508s

fpsetmask_unmasked_long_double

Expected failure

PR misc/44767: 8 checks failed as expected; see output for more details

0.157064s

lib/libc/gen/t_siginfo

7.427952s

sigbus_adraln

Expected failure

QEMU fails to trap unaligned accesses: Test did not fault as expected

0.138794s

lib/libc/gen/t_sleep

211.550390s

nanosleep

Expected failure

Long reschedule latency due to PR kern/43997: Reschedule latency -41386001 exceeds allowable fuzz 40000000

0.208892s

sleep

Expected failure

Long reschedule latency due to PR kern/43997: Reschedule latency -1000000000 exceeds allowable fuzz 40000000

2.250479s

lib/libc/regex/t_regex_att

1.534767s

leftassoc

Expected failure

Reason for breakage unknown: /tmp/bracket/build/2016.06.15.04.33.52-i386/src/tests/lib/libc/regex/t_regex_att.c:377: res != matches ((0,4)(0,2)(2,3)(3,4) != (0,4)(0,1)(1,4)(4,4)): at line 3

0.100942s

lib/libc/sys/t_getrusage

6.155470s

getrusage_utime_back

Expected failure

PR kern/30115: user time went backwards

0.821721s

getrusage_utime_zero

Expected failure

PR kern/30115: anticipated error did not occur

5.090879s

lib/libm/t_cos

1.320579s

cosf_inf_neg

Expected failure

PR lib/45362: cosf(-Inf) != NaN

0.109486s

cosf_inf_pos

Expected failure

PR lib/45362: cosf(+Inf) != NaN

0.060183s

lib/libm/t_fmod

0.228301s

fmod

Expected failure

PR misc/44767: 1 checks failed as expected; see output for more details

0.189867s

lib/libm/t_log

6.606684s

log1p_inf_neg

Expected failure

PR lib/45362: log1p(-Inf) != NaN

0.071345s

log1p_one_neg

Expected failure

PR lib/45362: log1p(-1.0) != -HUGE_VAL

0.119295s

log1pf_inf_neg

Expected failure

PR lib/45362: log1pf(-Inf) != NaN

0.155377s

log1pf_one_neg

Expected failure

PR lib/45362: log1pf(-1.0) != -HUGE_VALF

0.145033s

lib/libm/t_pow

2.180594s

pow_one_neg_x

Expected failure

PR lib/45372: 2 checks failed as expected; see output for more details

0.119898s

powf_one_neg_x

Expected failure

PR lib/45372: 2 checks failed as expected; see output for more details

0.067986s

lib/libm/t_sin

1.215420s

sinf_inf_neg

Expected failure

PR lib/45362: sinf(-Inf) != NaN

0.057521s

sinf_inf_pos

Expected failure

PR lib/45362: sinf(+Inf) != NaN

0.058249s

lib/libm/t_tan

1.268427s

tanf_inf_neg

Expected failure

PR lib/45362: tanf(-Inf) != NaN

0.061696s

tanf_inf_pos

Expected failure

PR lib/45362: tanf(+Inf) != NaN

0.060765s

lib/libtre/t_regex_att

1.653170s

rightassoc

Expected failure

Reason for breakage unknown: /tmp/bracket/build/2016.06.15.04.33.52-i386/src/tests/lib/libtre/../libc/regex/t_regex_att.c:377: res != matches ((0,4)(0,1)(1,4)(4,4) != (0,4)(0,2)(2,3)(3,4)): at line 3

0.162326s

lib/libusbhid/t_usbhid

0.858932s

check_hid_logical_range

Expected failure

only the 32-bit opcode works, 8 and 16-bit is broken: 4 checks failed as expected; see output for more details

0.166469s

check_hid_physical_range

Expected failure

only the 32-bit opcode works, 8 and 16-bit is broken: 4 checks failed as expected; see output for more details

0.110222s

lib/librumphijack/t_tcpip

32.668396s

ssh

Expected failure

PR lib/50174: atf-check failed; see the output of the test for details

7.945929s

sbin/resize_ffs/t_shrink

291.571637s

shrink_24M_16M_v2_4096

Expected failure

PR bin/44205: atf-check failed; see the output of the test for details

77.532172s

sbin/resize_ffs/t_shrink_swapped

156.527808s

shrink_24M_16M_v2_16384

Expected failure

PR bin/44205: atf-check failed; see the output of the test for details

45.605679s

usr.bin/make/t_make

225.949972s

escape

Expected failure

see PR toolchain/49085: atf-check failed; see the output of the test for details

2.580518s

impsrc

Expected failure

see PR toolchain/49085: atf-check failed; see the output of the test for details

4.841547s

phony_end

Expected failure

see PR toolchain/49085: atf-check failed; see the output of the test for details

7.193844s

posix1

Expected failure

see PR toolchain/49085: atf-check failed; see the output of the test for details

13.903766s

suffixes

Expected failure

see PR toolchain/49085: this uses up all memory and then fails

3.361113s

usr.bin/sed/t_sed

11.384303s

emptybackref

Expected failure

PR bin/28126: atf-check failed; see the output of the test for details

1.507855s

usr.sbin/useradd/t_useradd

2.712543s

longname

Expected failure

PR bin/39546: atf-check failed; see the output of the test for details

2.679433s

fs/ffs/t_mount

3.112837s

48Kimage

Expected failure

PR kern/43573: mount failed: Invalid argument

1.016231s

fs/nfs/t_mountd

9.716052s

mountdhup

Expected failure

PR kern/5844: op failed with EACCES

9.556403s

fs/vfs/t_renamerace

233.277561s

msdosfs_renamerace

Expected failure

PR kern/43626: unmount failed: Device busy

6.658161s

msdosfs_renamerace_dirs

Expected signal

PR kern/43626

10.936945s

udf_renamerace

Expected failure

PR kern/49046: race did not trigger this time

11.594474s

fs/vfs/t_vfsops

204.946206s

lfs_tfhremove

Expected failure

fhopen() for removed file succeeds (PR kern/43745): /tmp/bracket/build/2016.06.15.04.33.52-i386/src/tests/fs/vfs/t_vfsops.c:152: Expected true value in rump_sys_fhopen(fhp, fhsize, O_RDONLY) == -1

4.505979s

fs/vfs/t_vnops

1328.454923s

udf_lookup_complex

Expected failure

PR kern/49033: stat results differ, see ouput for more details

2.450999s

ipf/t_filter_exec

138.883622s

f26

Expected failure

Known to be broken: results differ

3.042582s

f27

Expected failure

Known to be broken: atf-check failed; see the output of the test for details

1.865368s

ipf/t_filter_parse

36.401501s

i17

Expected failure

Known to be broken: atf-check failed; see the output of the test for details

1.702961s

atf/atf-c/macros_test

18.446134s

detect_unused_tests

Expected failure

PR 49187: Build of unused_test.c passed; unused test cases are not properly detected

5.904136s

atf/atf-c++/macros_test

99.550822s

detect_unused_tests

Expected failure

PR 49187: Build of unused_test.cpp passed; unused test cases are not properly detected

42.179541s

Skipped test cases summary

Test case

Result

Reason

Duration

games/t_factor

0.062070s

loop

Skipped

Required program '/usr/games/factor' not found in the PATH

0.018899s

overflow

Skipped

Required program '/usr/games/factor' not found in the PATH

0.002901s

lib/libc/gen/t_siginfo

7.427952s

sigfpe_flt

Skipped

Test does not run correctly under QEMU

0.125379s

lib/libc/regex/t_exhaust

0.023213s

regcomp_too_big

Skipped

Not enough memory; needed 125829120, available 41521152

0.010517s

lib/libc/rpc/t_rpc

4.005525s

get_svc_addr_tcp

Skipped

clnt_create (: RPC: Port mapper failure - RPC: Timed out)

1.517532s

get_svc_addr_udp

Skipped

clnt_create (: RPC: Port mapper failure - RPC: Timed out)

1.414644s

lib/libc/string/t_popcount

0.330653s

popcount_basic

Skipped

config variable "run_popcount" not set to YES/TRUE

0.078797s

popcountll_basic

Skipped

config variable "run_popcount" not set to YES/TRUE

0.179653s

lib/libc/sys/t_kevent

0.398508s

kqueue_desc_passing

Skipped

PR kern/46523

0.115680s

lib/libc/sys/t_mmap

1.747545s

mmap_block

Skipped

The test case causes a panic (PR kern/38889, kern/46592)

0.133814s

lib/libc/sys/t_mprotect

0.780165s

mprotect_exec

Skipped

PaX MPROTECT restrictions enabled

0.148690s

lib/libtre/t_exhaust

0.021484s

regcomp_too_big

Skipped

Not enough memory; needed 125829120, available 41521152

0.010191s

net/mpls/t_ldp_regen

1.746737s

ldp_regen

Skipped

unreliable under qemu, skip until PR kern/43997 fixed

1.710027s

usr.bin/cc/t_hello

17.953337s

hello32

Skipped

this is not a 64 bit architecture

1.553000s

fs/vfs/t_full

92.292552s

puffs_fillfs

Skipped

fs does not support explicit block allocation (GOP_ALLOC)

1.363142s

rumpfs_fillfs

Skipped

fs does not support explicit block allocation (GOP_ALLOC)

1.200952s

fs/vfs/t_renamerace

233.277561s

rumpfs_renamerace

Skipped

rename not supported by file system

1.196496s

rumpfs_renamerace_dirs

Skipped

rename not supported by file system

0.999123s

sysvbfs_renamerace

Skipped

filesystem has not enough inodes

1.291270s

sysvbfs_renamerace_dirs

Skipped

directories not supported by file system

1.204106s

fs/vfs/t_rmdirrace

215.471185s

sysvbfs_race

Skipped

directories not supported by file system

2.170781s

fs/vfs/t_union

76.377293s

ext2fs_basic

Skipped

fs does not support VOP_WHITEOUT

2.239267s

ext2fs_whiteout

Skipped

fs does not support VOP_WHITEOUT

3.618653s

msdosfs_basic

Skipped

fs does not support VOP_WHITEOUT

2.608736s

msdosfs_whiteout

Skipped

fs does not support VOP_WHITEOUT

2.910195s

nfs_basic

Skipped

fs does not support VOP_WHITEOUT

7.816260s

p2k_ffs_basic

Skipped

fs does not support VOP_WHITEOUT

5.240951s

p2k_ffs_whiteout

Skipped

fs does not support VOP_WHITEOUT

3.593541s

puffs_basic

Skipped

fs does not support VOP_WHITEOUT

1.342661s

puffs_whiteout

Skipped

fs does not support VOP_WHITEOUT

2.099239s

sysvbfs_basic

Skipped

fs does not support VOP_WHITEOUT

1.340955s

sysvbfs_whiteout

Skipped

fs does not support VOP_WHITEOUT

1.694974s

udf_basic

Skipped

fs does not support VOP_WHITEOUT

1.443014s

udf_whiteout

Skipped

fs does not support VOP_WHITEOUT

1.940590s

v7fs_basic

Skipped

fs does not support VOP_WHITEOUT

1.913443s

v7fs_whiteout

Skipped

fs does not support VOP_WHITEOUT

2.558724s

fs/vfs/t_unpriv

138.149237s

msdosfs_owner

Skipped

owner not supported by file system

1.244633s

nfs_flags

Skipped

file flags not supported by file system

5.850350s

puffs_flags

Skipped

file flags not supported by file system

2.091174s

sysvbfs_dirperms

Skipped

directories not supported by file system

1.720928s

sysvbfs_flags

Skipped

file flags not supported by file system

1.983735s

udf_flags

Skipped

file flags not supported by file system

2.559048s

fs/vfs/t_vfsops

204.946206s

rumpfs_tfhinval

Skipped

file handles not supported

1.148438s

rumpfs_tfhremove

Skipped

file handles not supported

1.067948s

rumpfs_tfilehandle

Skipped

file handles not supported

1.169534s

sysvbfs_tfhinval

Skipped

file handles not supported

1.626969s

sysvbfs_tfhremove

Skipped

file handles not supported

1.258850s

sysvbfs_tfilehandle

Skipped

file handles not supported

1.420741s

udf_tfhinval

Skipped

file handles not supported

2.349827s

udf_tfhremove

Skipped

file handles not supported

2.121629s

v7fs_tfhinval

Skipped

file handles not supported

2.651642s

v7fs_tfhremove

Skipped

file handles not supported

1.718548s

v7fs_tfilehandle

Skipped

file handles not supported

1.766962s

fs/vfs/t_vnops

1328.454923s

msdosfs_lstat_symlink

Skipped

symlinks not supported by file system

2.782812s

msdosfs_symlink_long

Skipped

symlinks not supported by file system

1.443240s

msdosfs_symlink_root

Skipped

symlinks not supported by file system

1.472492s

msdosfs_symlink_zerolen

Skipped

symlinks not supported by file system

1.447912s

rumpfs_rename_dir

Skipped

rename not supported by file system

1.689975s

rumpfs_rename_dotdot

Skipped

rename not supported by file system

1.568256s

rumpfs_rename_nametoolong

Skipped

rename not supported by file system

2.249436s

rumpfs_rename_reg_nodir

Skipped

rename not supported by file system

2.071212s

sysvbfs_dir_notempty

Skipped

directories not supported by file system

2.571739s

sysvbfs_dir_rmdirdotdot

Skipped

directories not supported by file system

2.610777s

sysvbfs_dir_simple

Skipped

directories not supported by file system

2.326994s

sysvbfs_lookup_complex

Skipped

directories not supported by file system

2.494407s

sysvbfs_lstat_symlink

Skipped

symlinks not supported by file system

2.471588s

sysvbfs_rename_dir

Skipped

directories not supported by file system

2.520631s

sysvbfs_rename_dotdot

Skipped

directories not supported by file system

2.536539s

sysvbfs_symlink_long

Skipped

symlinks not supported by file system

1.442470s

sysvbfs_symlink_root

Skipped

symlinks not supported by file system

1.359324s

sysvbfs_symlink_zerolen

Skipped

symlinks not supported by file system

1.821567s

fs/cd9660/t_high_ino_big_file

1.782168s

pr_kern_48787

Skipped

not enough free disk space, have 357848 Kbytes, need ~ 4500000 Kbytes

1.687573s

rump/rumpkern/t_kern

3.483938s

lockme_DOUBLEINIT

Skipped

test requires LOCKDEBUG kernel

0.151489s

lockme_MEMFREE

Skipped

test requires LOCKDEBUG kernel

0.220162s

lockme_RWRX

Skipped

test requires LOCKDEBUG kernel

0.128173s

rump/rumpkern/t_sp

49.716802s

stress_long

Skipped

Not enough memory; needed 67108864, available 41504768

0.028047s

stress_short

Skipped

Not enough memory; needed 67108864, available 41504768

0.002380s

crypto/libcrypto/t_ciphers

47.597880s

rc5

Skipped

RC5 support not available; system built with MKCRYPTO_RC5=no

0.907700s

crypto/opencrypto/t_opencrypto

50.714191s

arc4

Skipped

ARC4 not implemented by swcrypto

2.464548s

share/examples/t_asm

3.414566s

hello

Skipped

Example program not implemented on this platform

3.310997s

atf/atf-c/pkg_config_test

0.096502s

build

Skipped

Required program 'pkg-config' not found in the PATH

0.030151s

version

Skipped

Required program 'pkg-config' not found in the PATH

0.012581s

atf/atf-c++/pkg_config_test

0.073961s

build

Skipped

Required program 'pkg-config' not found in the PATH

0.017633s

version

Skipped

Required program 'pkg-config' not found in the PATH

0.013942s

Bogus test programs summary

Test program

bin/cp/t_cp

0.029260s

bin/df/t_df

0.010957s

bin/ps/t_ps

0.016900s

lib/libc/tls/t_tls_static

0.009150s

lib/libc/tls/t_tls_dynamic

0.003367s

lib/libc/tls/t_tls_dlopen

0.003148s

lib/librumpclient/t_exec

0.024081s

usr.bin/xlint/lint1/t_integration

0.026625s

usr.sbin/mtree/t_mtree

0.020277s

fs/tmpfs/t_mknod

0.068959s

Execution details

Environment variables

Test case: bin/expr/t_expr/multiply

Duration: 0.082862 seconds

Termination reason

FAILED: Test program received signal 11 (core dumped)

Standard error stream

Test program crashed; attempting to get stack trace
Expected file /tmp/atf-run.tObyiR/t_expr.core not found

Test case: bin/sh/dotcmd/t_dotcmd/for_return_func

Duration: 1.361886 seconds

Termination reason

FAILED: Test case exited normally but failed to create the results file: Failed to open /tmp/atf-run.7gBRGI/tcr

Standard error stream

[1]   Done                    echo ${1} |
      Segmentation fault (core dumped) tr .- __

Test case: bin/sh/dotcmd/t_dotcmd/subshell_continue_file

Duration: 0.083744 seconds

Termination reason

FAILED: Test program received signal 11 (core dumped)

Standard error stream

Test program crashed; attempting to get stack trace
Expected file /tmp/atf-run.bIuwkD/t_dotcmd.core not found

Test case: bin/sh/dotcmd/t_dotcmd/while_continue_compound

Duration: 1.262085 seconds

Termination reason

FAILED: atf-check failed; see the output of the test for details

Standard output stream

Executing command [ /usr/tests/bin/sh/dotcmd/while_continue_compound ]

Standard error stream

Fail: program did not exit cleanly
stdout:

stderr: