ATF Tests Results

Execution summary

Item

Value

ATF

Version

Automated Testing Framework 0.15 (atf-0.15)

Timings

Start time of tests

Wed Jun 20 23:10:51 UTC 2012

End time of tests

Thu Jun 21 00:48:01 UTC 2012

System information

Host name

Operating system

NetBSD

Operating system release

6.99.7

Operating system version

NetBSD 6.99.7 (GENERIC) #0: Wed Jun 20 22:57:44 UTC 2012 bracket@babylon5.NetBSD.org:/tmp/bracket/build/2012.06.14.20.18.16-sparc/obj/sys/arch/sparc/compile/GENERIC

Platform

sparc

Tests results

Root

/usr/tests

Test programs

519

Bogus test programs

0

Test cases

3188

Passed test cases

3054

Failed test cases

7

Expected failures

19

Skipped test cases

108

See more execution details

Test cases summary

Test case

Result

Reason

Duration

atf/atf-c/detail/dynstr_test

17.669856s

append_ap

Passed

N/A

3.394147s

append_fmt

Passed

N/A

3.425965s

clear

Passed

N/A

0.040000s

copy

Passed

N/A

0.040000s

cstring

Passed

N/A

0.039735s

equal_cstring

Passed

N/A

0.040000s

equal_dynstr

Passed

N/A

0.040000s

fini_disown

Passed

N/A

0.040000s

init

Passed

N/A

0.039301s

init_ap

Passed

N/A

0.040000s

init_fmt

Passed

N/A

0.040000s

init_raw

Passed

N/A

0.090000s

init_rep

Passed

N/A

1.256029s

init_substr

Passed

N/A

0.038620s

length

Passed

N/A

0.128372s

prepend_ap

Passed

N/A

4.440000s

prepend_fmt

Passed

N/A

4.430000s

rfind_ch

Passed

N/A

0.032568s

atf/atf-c/detail/env_test

0.160000s

get

Passed

N/A

0.031949s

has

Passed

N/A

0.033059s

set

Passed

N/A

0.040000s

unset

Passed

N/A

0.034298s

atf/atf-c/detail/fs_test

1.342695s

eaccess

Passed

N/A

0.150000s

exists

Passed

N/A

0.050000s

getcwd

Passed

N/A

0.040000s

mkdtemp_err

Passed

N/A

0.055744s

mkdtemp_ok

Passed

N/A

0.040000s

mkdtemp_umask

Passed

N/A

0.040000s

mkstemp_err

Passed

N/A

0.042329s

mkstemp_ok

Passed

N/A

0.041581s

mkstemp_umask

Passed

N/A

0.046003s

path_append

Passed

N/A

0.050000s

path_branch_path

Passed

N/A

0.051287s

path_copy

Passed

N/A

0.040000s

path_equal

Passed

N/A

0.041492s

path_is_absolute

Passed

N/A

0.050000s

path_is_root

Passed

N/A

0.050000s

path_leaf_name

Passed

N/A

0.051172s

path_normalize

Passed

N/A

0.080000s

path_to_absolute

Passed

N/A

0.045200s

rmdir_empty

Passed

N/A

0.040000s

rmdir_enotempty

Passed

N/A

0.040000s

rmdir_eperm

Passed

N/A

0.040000s

stat_mode

Passed

N/A

0.040000s

stat_perms

Passed

N/A

0.040000s

stat_type

Passed

N/A

0.032761s

atf/atf-c/detail/list_test

0.460000s

list_append

Passed

N/A

0.040000s

list_append_list

Passed

N/A

0.040000s

list_for_each

Passed

N/A

0.090000s

list_for_each_c

Passed

N/A

0.080000s

list_index

Passed

N/A

0.037905s

list_index_c

Passed

N/A

0.039972s

list_init

Passed

N/A

0.040000s

list_to_charpp_empty

Passed

N/A

0.040000s

list_to_charpp_some

Passed

N/A

0.040000s

atf/atf-c/detail/map_test

0.650000s

find

Passed

N/A

0.040000s

find_c

Passed

N/A

0.040000s

map_for_each

Passed

N/A

0.080200s

map_for_each_c

Passed

N/A

0.090000s

map_init

Passed

N/A

0.040000s

map_init_charpp_empty

Passed

N/A

0.040000s

map_init_charpp_null

Passed

N/A

0.040000s

map_init_charpp_short

Passed

N/A

0.041231s

map_init_charpp_some

Passed

N/A

0.040000s

map_insert

Passed

N/A

0.040000s

stable_keys

Passed

N/A

0.040000s

to_charpp_empty

Passed

N/A

0.040000s

to_charpp_some

Passed

N/A

0.040000s

atf/atf-c/detail/process_test

4.360000s

child_pid

Passed

N/A

0.090000s

child_wait_eintr

Passed

N/A

1.100000s

exec_failure

Passed

N/A

0.080000s

exec_list

Passed

N/A

0.070000s

exec_prehook

Passed

N/A

0.050000s

exec_success

Passed

N/A

0.060000s

fork_cookie

Passed

N/A

0.050000s

fork_out_capture_err_capture

Passed

N/A

0.060000s

fork_out_capture_err_connect

Passed

N/A

0.060000s

fork_out_capture_err_default

Passed

N/A

0.060000s

fork_out_capture_err_inherit

Passed

N/A

0.060000s

fork_out_capture_err_redirect_fd

Passed

N/A

0.060000s

fork_out_capture_err_redirect_path

Passed

N/A

0.060000s

fork_out_connect_err_capture

Passed

N/A

0.060000s

fork_out_connect_err_connect

Passed

N/A

0.061631s

fork_out_connect_err_default

Passed

N/A

0.060000s

fork_out_connect_err_inherit

Passed

N/A

0.061672s

fork_out_connect_err_redirect_fd

Passed

N/A

0.061002s

fork_out_connect_err_redirect_path

Passed

N/A

0.060000s

fork_out_default_err_capture

Passed

N/A

0.060483s

fork_out_default_err_connect

Passed

N/A

0.060000s

fork_out_default_err_default

Passed

N/A

0.061204s

fork_out_default_err_inherit

Passed

N/A

0.060000s

fork_out_default_err_redirect_fd

Passed

N/A

0.060000s

fork_out_default_err_redirect_path

Passed

N/A

0.062957s

fork_out_inherit_err_capture

Passed

N/A

0.060000s

fork_out_inherit_err_connect

Passed

N/A

0.062365s

fork_out_inherit_err_default

Passed

N/A

0.060000s

fork_out_inherit_err_inherit

Passed

N/A

0.061311s

fork_out_inherit_err_redirect_fd

Passed

N/A

0.060000s

fork_out_inherit_err_redirect_path

Passed

N/A

0.060000s

fork_out_redirect_fd_err_capture

Passed

N/A

0.059629s

fork_out_redirect_fd_err_connect

Passed

N/A

0.060000s

fork_out_redirect_fd_err_default

Passed

N/A

0.062110s

fork_out_redirect_fd_err_inherit

Passed

N/A

0.061867s

fork_out_redirect_fd_err_redirect_fd

Passed

N/A

0.060000s

fork_out_redirect_fd_err_redirect_path

Passed

N/A

0.061770s

fork_out_redirect_path_err_capture

Passed

N/A

0.060000s

fork_out_redirect_path_err_connect

Passed

N/A

0.061275s

fork_out_redirect_path_err_default

Passed

N/A

0.060000s

fork_out_redirect_path_err_inherit

Passed

N/A

0.060000s

fork_out_redirect_path_err_redirect_fd

Passed

N/A

0.062774s

fork_out_redirect_path_err_redirect_path

Passed

N/A

0.060000s

status_coredump

Passed

N/A

0.070000s

status_exited

Passed

N/A

0.052764s

status_signaled

Passed

N/A

0.050000s

stream_init_capture

Passed

N/A

0.044632s

stream_init_connect

Passed

N/A

0.040000s

stream_init_inherit

Passed

N/A

0.044225s

stream_init_redirect_fd

Passed

N/A

0.040000s

stream_init_redirect_path

Passed

N/A

0.042197s

atf/atf-c/detail/sanity_test

0.398700s

inv

Passed

N/A

0.090000s

post

Passed

N/A

0.086929s

pre

Passed

N/A

0.088707s

unreachable

Passed

N/A

0.090000s

atf/atf-c/detail/test_helpers_test

0.160000s

grep_file

Passed

N/A

0.060000s

grep_string

Passed

N/A

0.043234s

read_line

Passed

N/A

0.050000s

atf/atf-c/detail/text_test

0.330000s

for_each_word

Passed

N/A

0.040000s

format

Passed

N/A

0.040000s

format_ap

Passed

N/A

0.040000s

split

Passed

N/A

0.070000s

split_delims

Passed

N/A

0.050946s

to_bool

Passed

N/A

0.040000s

to_long

Passed

N/A

0.040000s

atf/atf-c/detail/user_test

0.194445s

euid

Passed

N/A

0.030448s

is_member_of_group

Passed

N/A

0.065983s

is_root

Passed

N/A

0.035653s

is_unprivileged

Passed

N/A

0.035831s

atf/atf-c/atf_c_test

1.547333s

include

Passed

N/A

1.506620s

atf/atf-c/build_test

0.829706s

c_o

Passed

N/A

0.080903s

cpp

Passed

N/A

0.060000s

cxx_o

Passed

N/A

0.070000s

equal_arrays

Passed

N/A

0.030000s

include

Passed

N/A

0.540000s

atf/atf-c/check_test

10.881784s

build_c_o

Passed

N/A

1.110000s

build_cpp

Passed

N/A

0.610000s

build_cxx_o

Passed

N/A

7.434045s

exec_array

Passed

N/A

0.160000s

exec_cleanup

Passed

N/A

0.070734s

exec_exitstatus

Passed

N/A

0.100000s

exec_stdout_stderr

Passed

N/A

0.093188s

exec_umask

Passed

N/A

0.032007s

exec_unknown

Passed

N/A

0.062489s

include

Passed

N/A

1.040000s

atf/atf-c/config_test

0.620000s

get

Passed

N/A

0.059696s

include

Passed

N/A

0.520000s

atf/atf-c/error_test

1.700000s

error_new

Passed

N/A

0.053235s

error_new_wo_memory

Passed

N/A

0.036651s

format

Passed

N/A

0.040000s

include

Passed

N/A

0.610000s

include_fwd

Passed

N/A

0.550000s

is_error

Passed

N/A

0.070000s

libc_format

Passed

N/A

0.041673s

libc_new

Passed

N/A

0.040000s

no_error

Passed

N/A

0.039500s

no_memory_format

Passed

N/A

0.030000s

no_memory_new

Passed

N/A

0.030000s

no_memory_twice

Passed

N/A

0.052936s

atf/atf-c/macros_test

3.314267s

check

Passed

N/A

0.140000s

check_eq

Passed

N/A

0.200137s

check_errno

Passed

N/A

0.110000s

check_streq

Passed

N/A

0.229628s

include

Passed

N/A

0.630000s

msg_embedded_fmt

Passed

N/A

0.180000s

require

Passed

N/A

0.100000s

require_eq

Passed

N/A

0.180000s

require_errno

Passed

N/A

0.110000s

require_streq

Passed

N/A

0.200000s

use

Passed

N/A

1.140000s

atf/atf-c/pkg_config_test

0.040000s

build

Skipped

Required program 'pkg-config' not found in the PATH

0.010000s

version

Skipped

Required program 'pkg-config' not found in the PATH

0.005561s

atf/atf-c/tc_test

0.860000s

config

Passed

N/A

0.060000s

include

Passed

N/A

0.625276s

init

Passed

N/A

0.057336s

init_pack

Passed

N/A

0.032374s

vars

Passed

N/A

0.036107s

atf/atf-c/tp_test

0.635356s

getopt

Passed

N/A

0.070000s

include

Passed

N/A

0.530000s

atf/atf-c/utils_test

0.680414s

free_charpp_empty

Passed

N/A

0.081645s

free_charpp_some

Passed

N/A

0.030000s

include

Passed

N/A

0.520180s

atf/atf-c++/detail/application_test

0.160000s

getopt

Passed

N/A

0.130000s

atf/atf-c++/detail/env_test

0.230000s

has_get

Passed

N/A

0.078493s

set

Passed

N/A

0.070000s

unset

Passed

N/A

0.072035s

atf/atf-c++/detail/exceptions_test

0.270000s

throw_atf_error_libc

Passed

N/A

0.110000s

throw_atf_error_no_memory

Passed

N/A

0.080000s

throw_atf_error_unknown

Passed

N/A

0.078401s

atf/atf-c++/detail/expand_test

0.560000s

expand_glob_base

Passed

N/A

0.110998s

expand_glob_tps

Passed

N/A

0.074277s

is_glob

Passed

N/A

0.083675s

matches_glob_plain

Passed

N/A

0.070000s

matches_glob_question

Passed

N/A

0.080000s

matches_glob_star

Passed

N/A

0.081330s

atf/atf-c++/detail/fs_test

1.682184s

directory_file_info

Passed

N/A

0.080000s

directory_names

Passed

N/A

0.080000s

directory_read

Passed

N/A

0.100000s

exists

Passed

N/A

0.140000s

file_info_perms

Passed

N/A

0.099410s

file_info_stat

Passed

N/A

0.078001s

is_executable

Passed

N/A

0.090000s

path_branch_path

Passed

N/A

0.090000s

path_compare_different

Passed

N/A

0.070121s

path_compare_equal

Passed

N/A

0.082104s

path_concat

Passed

N/A

0.080000s

path_is_absolute

Passed

N/A

0.079040s

path_is_root

Passed

N/A

0.070000s

path_leaf_name

Passed

N/A

0.070000s

path_normalize

Passed

N/A

0.080000s

path_op_less

Passed

N/A

0.080000s

path_to_absolute

Passed

N/A

0.070125s

remove

Passed

N/A

0.090000s

atf/atf-c++/detail/parser_test

2.100000s

headers_1

Passed

N/A

0.160000s

headers_10

Passed

N/A

0.130000s

headers_11

Passed

N/A

0.080000s

headers_12

Passed

N/A

0.090000s

headers_2

Passed

N/A

0.073502s

headers_3

Passed

N/A

0.080000s

headers_4

Passed

N/A

0.070000s

headers_5

Passed

N/A

0.080000s

headers_6

Passed

N/A

0.080000s

headers_7

Passed

N/A

0.090000s

headers_8

Passed

N/A

0.080000s

headers_9

Passed

N/A

0.080000s

parse_error_to_string

Passed

N/A

0.080000s

parse_errors_what

Passed

N/A

0.080000s

token_getters

Passed

N/A

0.080000s

tokenizer_delims_nows

Passed

N/A

0.090000s

tokenizer_delims_ws

Passed

N/A

0.080000s

tokenizer_keywords_nows

Passed

N/A

0.090000s

tokenizer_keywords_ws

Passed

N/A

0.080000s

tokenizer_minimal_nows

Passed

N/A

0.090000s

tokenizer_minimal_ws

Passed

N/A

0.080000s

tokenizer_quotes_nows

Passed

N/A

0.077159s

tokenizer_quotes_ws

Passed

N/A

0.077636s

atf/atf-c++/detail/sanity_test

0.140936s

nothing

Passed

N/A

0.120000s

atf/atf-c++/detail/text_test

0.980000s

duplicate

Passed

N/A

0.074674s

join

Passed

N/A

0.080000s

match

Passed

N/A

0.092172s

split

Passed

N/A

0.128533s

split_delims

Passed

N/A

0.140000s

to_bool

Passed

N/A

0.079102s

to_bytes

Passed

N/A

0.080000s

to_string

Passed

N/A

0.075752s

to_type

Passed

N/A

0.080000s

trim

Passed

N/A

0.076545s

atf/atf-c++/detail/ui_test

0.744067s

paragraphs

Passed

N/A

0.130000s

w_tag_col

Passed

N/A

0.170000s

w_tag_no_repeat

Passed

N/A

0.124626s

w_tag_repeat

Passed

N/A

0.084875s

wo_tag

Passed

N/A

0.100000s

wo_tag_col

Passed

N/A

0.090000s

atf/atf-c++/atf_c++_test

7.066335s

include

Passed

N/A

7.028302s

atf/atf-c++/build_test

3.112687s

c_o

Passed

N/A

0.156447s

cpp

Passed

N/A

0.100000s

cxx_o

Passed

N/A

0.150000s

equal_argvs

Passed

N/A

0.070555s

include

Passed

N/A

2.600460s

atf/atf-c++/check_test

13.112977s

build_c_o

Passed

N/A

1.740000s

build_cpp

Passed

N/A

0.690567s

build_cxx_o

Passed

N/A

6.169343s

exec_cleanup

Passed

N/A

0.312727s

exec_exitstatus

Passed

N/A

0.231441s

exec_stdout_stderr

Passed

N/A

0.160000s

exec_unknown

Passed

N/A

0.128266s

include

Passed

N/A

3.554386s

atf/atf-c++/config_test

3.420000s

get

Passed

N/A

0.130807s

get_all

Passed

N/A

0.080000s

has

Passed

N/A

0.150000s

include

Passed

N/A

3.010000s

atf/atf-c++/macros_test

17.280000s

check_errno

Passed

N/A

0.260000s

fail

Passed

N/A

0.140242s

include

Passed

N/A

6.850000s

pass

Passed

N/A

0.370000s

require

Passed

N/A

0.160000s

require_eq

Passed

N/A

0.170000s

require_errno

Passed

N/A

0.160000s

require_in

Passed

N/A

0.210000s

require_match

Passed

N/A

0.130000s

require_not_in

Passed

N/A

0.200000s

require_throw

Passed

N/A

0.180000s

require_throw_re

Passed

N/A

0.170000s

skip

Passed

N/A

0.090000s

use

Passed

N/A

8.000000s

atf/atf-c++/pkg_config_test

0.053483s

build

Skipped

Required program 'pkg-config' not found in the PATH

0.020000s

version

Skipped

Required program 'pkg-config' not found in the PATH

0.009245s

atf/atf-c++/tests_test

3.370000s

atf_tp_writer

Passed

N/A

0.110000s

include

Passed

N/A

3.240000s

atf/atf-c++/utils_test

1.537459s

auto_array_access

Passed

N/A

0.087108s

auto_array_assign

Passed

N/A

0.081393s

auto_array_assign_ref

Passed

N/A

0.080399s

auto_array_copy

Passed

N/A

0.073573s

auto_array_copy_ref

Passed

N/A

0.077474s

auto_array_get

Passed

N/A

0.078787s

auto_array_release

Passed

N/A

0.074936s

auto_array_reset

Passed

N/A

0.074198s

auto_array_scope

Passed

N/A

0.070000s

include

Passed

N/A

0.772741s

atf/atf-sh/tc_test

2.510000s

default_status

Passed

N/A

1.810000s

missing_body

Passed

N/A

0.670000s

atf/atf-sh/tp_test

1.010000s

srcdir

Passed

N/A

0.990000s

atf/atf-sh/normalize_test

0.930000s

main

Passed

N/A

0.910000s

atf/atf-sh/config_test

3.210000s

get

Passed

N/A

1.544657s

has

Passed

N/A

1.630942s

atf/atf-sh/atf-check_test

25.080000s

eflag_empty

Passed

N/A

0.870000s

eflag_file

Passed

N/A

1.301940s

eflag_ignore

Passed

N/A

0.800000s

eflag_inline

Passed

N/A

1.835417s

eflag_match

Passed

N/A

1.146525s

eflag_multiple

Passed

N/A

1.010000s

eflag_negated

Passed

N/A

1.188158s

eflag_save

Passed

N/A

0.620000s

invalid_umask

Passed

N/A

0.590000s

oflag_empty

Passed

N/A

0.850433s

oflag_file

Passed

N/A

1.250000s

oflag_ignore

Passed

N/A

0.720033s

oflag_inline

Passed

N/A

1.674145s

oflag_match

Passed

N/A

1.250802s

oflag_multiple

Passed

N/A

1.040000s

oflag_negated

Passed

N/A

1.060000s

oflag_save

Passed

N/A

0.629708s

sflag_eq_ne

Passed

N/A

1.410303s

sflag_exit

Passed

N/A

1.990000s

sflag_ignore

Passed

N/A

0.790000s

sflag_signal

Passed

N/A

1.278065s

stdin

Passed

N/A

0.563911s

xflag

Passed

N/A

0.774125s

atf/atf-sh/atf_check_test

8.400000s

equal

Passed

N/A

2.110000s

experr_mismatch

Passed

N/A

1.178779s

expout_mismatch

Passed

N/A

1.210000s

info_ok

Passed

N/A

1.530608s

null_stderr

Passed

N/A

1.100000s

null_stdout

Passed

N/A

1.125930s

atf/atf-sh/integration_test

2.060000s

arguments

Passed

N/A

0.926018s

missing_script

Passed

N/A

0.500000s

no_args

Passed

N/A

0.590000s

atf/test-programs/config_test

4.930000s

vflag

Passed

N/A

4.900000s

atf/test-programs/expect_test

17.106558s

expect_death

Passed

N/A

3.141321s

expect_exit

Passed

N/A

3.160000s

expect_fail

Passed

N/A

3.054063s

expect_pass

Passed

N/A

2.804616s

expect_signal

Passed

N/A

3.339906s

expect_timeout

Passed

N/A

1.500000s

atf/test-programs/fork_test

2.750000s

stop

Passed

N/A

2.730000s

atf/test-programs/meta_data_test

12.370000s

no_descr

Passed

N/A

6.170000s

no_head

Passed

N/A

6.130000s

atf/test-programs/srcdir_test

15.573437s

default

Passed

N/A

2.480000s

libtool

Passed

N/A

2.620000s

relative

Passed

N/A

7.060000s

sflag

Passed

N/A

3.179413s

atf/test-programs/result_test

8.810000s

atf_run_warnings

Passed

N/A

1.120000s

result_exception

Passed

N/A

0.600000s

result_on_stdout

Passed

N/A

2.350000s

result_to_file

Passed

N/A

3.290000s

result_to_file_fail

Passed

N/A

1.380000s

atf/atf-config/integration_test

43.963585s

list_all

Passed

N/A

2.330000s

override_env

Passed

N/A

20.630000s

query_mixture

Passed

N/A

4.340000s

query_multiple

Passed

N/A

0.850000s

query_one

Passed

N/A

4.658786s

query_one_terse

Passed

N/A

10.352098s

query_unknown

Passed

N/A

0.610000s

atf/atf-report/integration_test

22.777287s

default

Passed

N/A

2.580000s

expect

Passed

N/A

5.340000s

oflag

Passed

N/A

4.750000s

output_csv

Passed

N/A

2.510000s

output_ticker

Passed

N/A

2.590000s

output_xml

Passed

N/A

2.542849s

output_xml_space

Passed

N/A

1.640000s

too_many_args

Passed

N/A

0.580000s

atf/atf-report/reader_test

2.020023s

tps_1

Passed

N/A

0.106469s

tps_2

Passed

N/A

0.080000s

tps_3

Passed

N/A

0.090000s

tps_4

Passed

N/A

0.082934s

tps_5

Passed

N/A

0.078278s

tps_50

Passed

N/A

0.090000s

tps_51

Passed

N/A

0.072995s

tps_52

Passed

N/A

0.071944s

tps_53

Passed

N/A

0.070736s

tps_54

Passed

N/A

0.090000s

tps_55

Passed

N/A

0.090000s

tps_56

Passed

N/A

0.081569s

tps_57

Passed

N/A

0.079011s

tps_58

Passed

N/A

0.080000s

tps_59

Passed

N/A

0.080000s

tps_6

Passed

N/A

0.090000s

tps_60

Passed

N/A

0.080000s

tps_61

Passed

N/A

0.075026s

tps_62

Passed

N/A

0.080000s

tps_63

Passed

N/A

0.080000s

tps_64

Passed

N/A

0.092264s

tps_65

Passed

N/A

0.084823s

tps_66

Passed

N/A

0.080000s

atf/atf-run/atffile_test

1.450000s

atffile_1

Passed

N/A

0.130000s

atffile_2

Passed

N/A

0.070000s

atffile_3

Passed

N/A

0.071875s

atffile_4

Passed

N/A

0.070000s

atffile_5

Passed

N/A

0.070000s

atffile_50

Passed

N/A

0.090000s

atffile_51

Passed

N/A

0.080000s

atffile_52

Passed

N/A

0.090000s

atffile_53

Passed

N/A

0.080000s

atffile_54

Passed

N/A

0.080000s

atffile_6

Passed

N/A

0.070000s

atffile_getters

Passed

N/A

0.080000s

read_missing_test_program

Passed

N/A

0.090000s

read_missing_test_suite

Passed

N/A

0.080000s

read_ok_simple

Passed

N/A

0.090000s

read_ok_some_globs

Passed

N/A

0.090000s

atf/atf-run/config_test

1.240000s

config_1

Passed

N/A

0.150000s

config_2

Passed

N/A

0.070000s

config_3

Passed

N/A

0.070000s

config_4

Passed

N/A

0.100000s

config_50

Passed

N/A

0.090000s

config_51

Passed

N/A

0.070000s

config_52

Passed

N/A

0.070000s

config_53

Passed

N/A

0.070000s

config_54

Passed

N/A

0.070000s

merge_configs_both_empty

Passed

N/A

0.070000s

merge_configs_lower_empty

Passed

N/A

0.070000s

merge_configs_mixed

Passed

N/A

0.080000s

merge_configs_upper_empty

Passed

N/A

0.072330s

read_config_files_none

Passed

N/A

0.078741s

atf/atf-run/fs_test

0.669532s

change_directory

Passed

N/A

0.091768s

cleanup

Passed

N/A

0.147644s

cleanup_eacces_on_root

Passed

N/A

0.121873s

cleanup_eacces_on_subdir

Passed

N/A

0.080000s

get_current_dir

Passed

N/A

0.080000s

temp_dir_raii

Passed

N/A

0.071912s

atf/atf-run/integration_test

185.140000s

atffile

Passed

N/A

7.540000s

atffile_recursive

Passed

N/A

4.001817s

broken_results

Passed

N/A

2.420000s

broken_tp_list

Passed

N/A

1.940000s

cleanup_curdir

Passed

N/A

2.320857s

cleanup_fail

Passed

N/A

2.330000s

cleanup_mount

Passed

N/A

3.450000s

cleanup_pass

Passed

N/A

2.350000s

cleanup_signal

Passed

N/A

0.443629s

cleanup_skip

Passed

N/A

2.262390s

cleanup_symlink

Passed

N/A

3.640000s

config

Passed

N/A

7.630000s

exit_codes

Passed

N/A

2.290000s

expect

Passed

N/A

5.370000s

fds

Passed

N/A

2.217420s

hooks

Passed

N/A

7.570000s

ignore_deprecated_use_fs

Passed

N/A

2.248327s

isolation_env

Passed

N/A

4.110000s

isolation_home

Passed

N/A

2.250000s

isolation_stdin

Passed

N/A

2.265593s

isolation_umask

Passed

N/A

2.270000s

missing_results

Passed

N/A

2.246123s

mux_streams

Passed

N/A

30.223094s

no_warnings

Passed

N/A

2.200000s

require_arch

Passed

N/A

15.560086s

require_config

Passed

N/A

5.410000s

require_files

Passed

N/A

8.650000s

require_machine

Passed

N/A

15.520000s

require_progs

Passed

N/A

8.583647s

require_user_bad

Passed

N/A

2.120000s

require_user_root

Passed

N/A

2.290000s

require_user_unprivileged

Passed

N/A

2.160000s

signaled

Passed

N/A

2.560000s

timeout

Passed

N/A

4.140000s

timeout_forkexit

Passed

N/A

2.280000s

vflag

Passed

N/A

7.540000s

zero_tcs

Passed

N/A

2.130000s

atf/atf-run/io_test

26.070000s

file_handle_copy

Passed

N/A

0.130000s

file_handle_ctor

Passed

N/A

0.080000s

file_handle_get

Passed

N/A

0.220000s

file_handle_posix_remap

Passed

N/A

0.070000s

muxer_large_buffer

Passed

N/A

14.589541s

muxer_small_buffer

Passed

N/A

10.236467s

pistream

Passed

N/A

0.070000s

systembuf_long_read

Passed

N/A

0.307691s

systembuf_long_write

Passed

N/A

0.150000s

systembuf_short_read

Passed

N/A

0.070215s

systembuf_short_write

Passed

N/A

0.080000s

atf/atf-run/requirements_test

2.620000s

require_arch_many_fail

Passed

N/A

0.200000s

require_arch_many_ok

Passed

N/A

0.077331s

require_arch_one_fail

Passed

N/A

0.078192s

require_arch_one_ok

Passed

N/A

0.070000s

require_config_many_fail

Passed

N/A

0.077340s

require_config_many_ok

Passed

N/A

0.070000s

require_config_one_fail

Passed

N/A

0.076954s

require_config_one_ok

Passed

N/A

0.070000s

require_files_many_fail

Passed

N/A

0.090000s

require_files_many_missing

Passed

N/A

0.080000s

require_files_many_ok

Passed

N/A

0.070000s

require_files_one_fail

Passed

N/A

0.070761s

require_files_one_missing

Passed

N/A

0.070000s

require_files_one_ok

Passed

N/A

0.070000s

require_machine_many_fail

Passed

N/A

0.070000s

require_machine_many_ok

Passed

N/A

0.070000s

require_machine_one_fail

Passed

N/A

0.070000s

require_machine_one_ok

Passed

N/A

0.070000s

require_memory_fail

Passed

N/A

0.070000s

require_memory_not_enough

Passed

N/A

0.090000s

require_memory_ok

Passed

N/A

0.079963s

require_progs_many_fail

Passed

N/A

0.080000s

require_progs_many_missing

Passed

N/A

0.080310s

require_progs_many_ok

Passed

N/A

0.080000s

require_progs_one_fail

Passed

N/A

0.090000s

require_progs_one_missing

Passed

N/A

0.080000s

require_progs_one_ok

Passed

N/A

0.080000s

require_user_fail

Passed

N/A

0.080000s

require_user_root

Passed

N/A

0.080000s

require_user_unprivileged

Passed

N/A

0.080000s

atf/atf-run/signals_test

0.550000s

reset

Passed

N/A

0.140000s

signal_holder_destructor

Passed

N/A

0.070000s

signal_holder_preserve

Passed

N/A

0.070000s

signal_holder_process

Passed

N/A

0.070000s

signal_programmer_preserve

Passed

N/A

0.070000s

signal_programmer_program

Passed

N/A

0.079804s

atf/atf-run/test_program_test

3.379422s

atf_tps_writer

Passed

N/A

0.330000s

get_metadata_bad

Passed

N/A

0.243354s

get_metadata_several_tcs

Passed

N/A

0.170000s

get_metadata_zero_tcs

Passed

N/A

0.165034s

parse_test_case_result_expected_death

Passed

N/A

0.080000s

parse_test_case_result_expected_exit

Passed

N/A

0.073280s

parse_test_case_result_expected_failure

Passed

N/A

0.079918s

parse_test_case_result_expected_signal

Passed

N/A

0.080000s

parse_test_case_result_expected_timeout

Passed

N/A

0.075724s

parse_test_case_result_failed

Passed

N/A

0.075134s

parse_test_case_result_passed

Passed

N/A

0.075997s

parse_test_case_result_skipped

Passed

N/A

0.130000s

parse_test_case_result_unknown

Passed

N/A

0.130000s

read_test_case_result_empty_file

Passed

N/A

0.077745s

read_test_case_result_invalid

Passed

N/A

0.080000s

read_test_case_result_multiline

Passed

N/A

0.080000s

read_test_case_result_no_file

Passed

N/A

0.076073s

tp_1

Passed

N/A

0.086528s

tp_2

Passed

N/A

0.080000s

tp_3

Passed

N/A

0.075971s

tp_4

Passed

N/A

0.073758s

tp_50

Passed

N/A

0.074692s

tp_51

Passed

N/A

0.072028s

tp_52

Passed

N/A

0.071748s

tp_53

Passed

N/A

0.072959s

tp_54

Passed

N/A

0.072105s

tp_55

Passed

N/A

0.075726s

tp_56

Passed

N/A

0.078318s

tp_57

Passed

N/A

0.080000s

tp_58

Passed

N/A

0.080000s

tp_59

Passed

N/A

0.076519s

tp_60

Passed

N/A

0.075568s

atf/atf-run/user_test

0.405369s

euid

Passed

N/A

0.130000s

is_member_of_group

Passed

N/A

0.100000s

is_root

Passed

N/A

0.069408s

is_unprivileged

Passed

N/A

0.070000s

bin/cat/t_cat

1.120000s

align

Passed

N/A

0.570000s

nonexistent

Passed

N/A

0.516878s

bin/cp/t_cp

8.747979s

dir_to_dir

Passed

N/A

1.750000s

dir_to_file

Passed

N/A

0.700000s

file_over_link

Passed

N/A

0.627689s

file_to_file

Passed

N/A

1.166968s

file_to_link

Passed

N/A

0.630000s

file_to_linkdir

Passed

N/A

0.780000s

files_to_dir

Passed

N/A

0.716034s

link_over_file

Passed

N/A

0.650853s

link_to_file

Passed

N/A

0.710000s

linkdir_to_file

Passed

N/A

0.760000s

bin/dd/t_dd

4.120000s

io

Passed

N/A

1.780000s

length

Passed

N/A

0.740000s

seek

Passed

N/A

1.530000s

bin/df/t_df

1.260000s

hflag

Passed

N/A

0.591825s

normal

Passed

N/A

0.620000s

bin/expr/t_expr

6.684211s

arithmetic_ops

Passed

N/A

0.531689s

basic_functional

Passed

N/A

0.380000s

basic_math

Passed

N/A

0.329248s

colon_vs_math

Passed

N/A

0.360000s

compare_ops

Passed

N/A

0.730000s

compare_ops_precedence

Passed

N/A

0.390000s

gtkmm

Passed

N/A

0.470000s

lang

Passed

N/A

0.731901s

math_precedence

Passed

N/A

0.447734s

multiply

Passed

N/A

0.390000s

negative

Passed

N/A

0.445018s

overflow

Passed

N/A

0.700000s

precedence

Passed

N/A

0.338435s

regex

Passed

N/A

0.330000s

bin/pax/t_pax

0.993363s

append

Passed

N/A

0.960000s

bin/ps/t_ps

11.832165s

default_columns

Passed

N/A

3.260000s

duplicate_column

Passed

N/A

0.935190s

minus_O

Passed

N/A

1.200000s

minus_o

Passed

N/A

1.440000s

override_heading_all_null

Passed

N/A

0.950000s

override_heading_embedded_specials

Passed

N/A

1.278195s

override_heading_simple

Passed

N/A

1.207617s

override_heading_some_null

Passed

N/A

1.440000s

bin/sh/t_compexit

0.380000s

set_e

Passed

N/A

0.360000s

bin/sh/t_exit

4.060000s

background

Passed

N/A

0.620000s

function

Passed

N/A

0.367610s

readout

Passed

N/A

0.310000s

trap_subshell

Passed

N/A

0.582126s

trap_zero__explicit_exit

Passed

N/A

0.730000s

trap_zero__explicit_return

Passed

N/A

0.649186s

trap_zero__implicit_exit

Passed

N/A

0.710000s

bin/sh/t_expand

1.740000s

arithmetic

Passed

N/A

0.390000s

dollar_at

Passed

N/A

0.380000s

dollar_at_with_text

Passed

N/A

0.340000s

strip

Expected failure

PR bin/43469: $stripped != ${line%%/\**} (#define bindir "/usr/bin" != #define bindir ")

0.290000s

varpattern_backslashes

Passed

N/A

0.290000s

bin/sh/t_evaltested

0.430000s

evaltested

Passed

N/A

0.400000s

bin/sh/t_fsplit

2.980000s

default_val

Passed

N/A

0.425241s

dollar_at

Passed

N/A

0.510000s

for

Passed

N/A

0.310000s

ifs

Passed

N/A

0.490000s

ifs_alpha

Passed

N/A

0.440000s

quote

Passed

N/A

0.425080s

var_length

Passed

N/A

0.340000s

bin/sh/t_here

0.770000s

all

Passed

N/A

0.760792s

bin/sh/t_set_e

9.250000s

all

Passed

N/A

9.220000s

bin/sh/t_ulimit

1.681203s

limits

Passed

N/A

1.670000s

bin/sh/t_varquote

0.890000s

all

Passed

N/A

0.370000s

nested_quotes_multiword

Passed

N/A

0.480000s

bin/sh/t_wait

3.440000s

individual

Passed

N/A

3.410000s

bin/sleep/t_sleep

3.801906s

fraction

Passed

N/A

1.370000s

hex

Passed

N/A

1.470000s

nonnumeric

Passed

N/A

0.920000s

bin/tar/t_tar

0.950000s

append

Passed

N/A

0.920000s

crypto/libcrypto/t_certs

0.610000s

x509v3

Passed

N/A

0.580000s

crypto/libcrypto/t_ciphers

13.680000s

bf

Passed

N/A

0.556855s

cast

Passed

N/A

9.410000s

des

Passed

N/A

0.620000s

evp

Passed

N/A

1.078842s

idea

Skipped

IDEA support not available; system built with MKCRYPTO_IDEA=no

0.410000s

rc2

Passed

N/A

0.496997s

rc4

Passed

N/A

0.617360s

rc5

Skipped

RC5 support not available; system built with MKCRYPTO_RC5=no

0.370000s

crypto/libcrypto/t_hashes

3.680000s

hmac

Passed

N/A

0.530000s

md2

Passed

N/A

0.480000s

md4

Passed

N/A

0.560000s

md5

Passed

N/A

0.570000s

mdc2

Skipped

MDC2 support not available; system built with MKCRYPTO_MDC2=no

0.338564s

ripemd

Passed

N/A

0.530000s

sha

Passed

N/A

0.597224s

crypto/libcrypto/t_libcrypto

54.590000s

bn

Passed

N/A

50.565819s

conf

Passed

N/A

0.699872s

engine

Passed

N/A

1.000000s

lhash

Passed

N/A

0.650000s

rand

Passed

N/A

0.540000s

threads

Passed

N/A

1.040000s

crypto/libcrypto/t_pubkey

133.410000s

dh

Passed

N/A

0.744285s

dsa

Passed

N/A

4.690000s

ec

Passed

N/A

34.838552s

ecdh

Passed

N/A

6.787239s

ecdsa

Passed

N/A

36.270000s

rsa

Passed

N/A

47.940000s

srp

Passed

N/A

2.039665s

dev/audio/t_pad

1.650000s

pad_output

Passed

N/A

1.635416s

dev/cgd/t_cgd

9.420000s

basic

Passed

N/A

2.664500s

unaligned_write

Passed

N/A

3.680000s

wrongpass

Passed

N/A

3.000000s

dev/md/t_md

2.520000s

basic

Passed

N/A

2.490000s

dev/raidframe/t_raid

69.940000s

raid1_comp0fail

Passed

N/A

10.450000s

raid1_compfail

Passed

N/A

15.650000s

raid1_normal

Passed

N/A

11.180000s

raid5_compfail

Passed

N/A

15.421455s

raid5_normal

Passed

N/A

15.273518s

smalldisk

Passed

N/A

1.770000s

dev/scsipi/t_cd

0.420000s

noisyeject

Passed

N/A

0.390000s

dev/sysmon/t_swwdog

6.320000s

disarm

Passed

N/A

2.762054s

panic

Passed

N/A

1.860000s

reboot

Passed

N/A

1.670000s

dev/sysmon/t_swsensor

79.320000s

alarm_sensor

Passed

N/A

30.070000s

limit_sensor

Passed

N/A

29.910000s

simple_sensor

Passed

N/A

19.270000s

examples/t_asm

1.229731s

hello

Skipped

Example program not implemented on this platform

1.190000s

fs/ffs/t_fifos

1.007235s

fifos

Passed

N/A

0.990000s

fs/ffs/t_snapshot

3.290000s

snapshot

Passed

N/A

3.269170s

fs/ffs/t_snapshot_log

3.940000s

snapshot

Passed

N/A

3.920262s

fs/ffs/t_snapshot_v2

8.010000s

snapshot

Passed

N/A

7.990000s

fs/ffs/t_mount

1.350000s

48Kimage

Expected failure

PR kern/43573: mount failed: Invalid argument

0.580000s

fsbsize2big

Passed

N/A

0.720000s

fs/ffs/t_quota2_1

56.028612s

quota_1000_O1_be

Passed

N/A

12.001026s

quota_1000_O1_le

Passed

N/A

12.920000s

quota_1000_O2_be

Passed

N/A

11.370000s

quota_1000_O2_le

Passed

N/A

12.460000s

quota_40_O1_be

Passed

N/A

1.241902s

quota_40_O1_le

Passed

N/A

1.191130s

quota_40_O1_log

Passed

N/A

1.110000s

quota_40_O2_be

Passed

N/A

1.201578s

quota_40_O2_le

Passed

N/A

1.200000s

quota_40_O2_log

Passed

N/A

1.110422s

fs/ffs/t_quota2_remount

1.863125s

quota_10_O1_be

Passed

N/A

0.950000s

quota_10_O1_le

Passed

N/A

0.870000s

fs/ffs/t_getquota

37.460000s

get_be_1_both

Passed

N/A

3.260000s

get_be_1_group

Passed

N/A

3.159584s

get_be_1_user

Passed

N/A

3.060000s

get_be_2_both

Passed

N/A

3.049736s

get_be_2_group

Passed

N/A

3.120000s

get_be_2_user

Passed

N/A

2.951096s

get_le_1_both

Passed

N/A

3.090000s

get_le_1_group

Passed

N/A

3.040000s

get_le_1_user

Passed

N/A

3.042440s

get_le_2_both

Passed

N/A

3.246768s

get_le_2_group

Passed

N/A

3.110000s

get_le_2_user

Passed

N/A

3.020000s

fs/ffs/t_setquota

133.244280s

set_be_1_both

Passed

N/A

3.660000s

set_be_1_group

Passed

N/A

3.970000s

set_be_1_user

Passed

N/A

3.838421s

set_be_2_both

Passed

N/A

3.627279s

set_be_2_group

Passed

N/A

3.630000s

set_be_2_user

Passed

N/A

3.551995s

set_default_be_1_both

Passed

N/A

3.140000s

set_default_be_1_group

Passed

N/A

3.136130s

set_default_be_1_user

Passed

N/A

3.081763s

set_default_be_2_both

Passed

N/A

3.070000s

set_default_be_2_group

Passed

N/A

3.040000s

set_default_be_2_user

Passed

N/A

3.170000s

set_default_le_1_both

Passed

N/A

3.171693s

set_default_le_1_group

Passed

N/A

3.188260s

set_default_le_1_user

Passed

N/A

3.095070s

set_default_le_2_both

Passed

N/A

3.090000s

set_default_le_2_group

Passed

N/A

3.035172s

set_default_le_2_user

Passed

N/A

2.980000s

set_le_1_both

Passed

N/A

3.594129s

set_le_1_group

Passed

N/A

3.800000s

set_le_1_user

Passed

N/A

3.493269s

set_le_2_both

Passed

N/A

3.560000s

set_le_2_group

Passed

N/A

3.870068s

set_le_2_user

Passed

N/A

3.460000s

set_new_be_1_both

Passed

N/A

3.075345s

set_new_be_1_both_log

Passed

N/A

3.357076s

set_new_be_1_group

Passed

N/A

3.230000s

set_new_be_1_user

Passed

N/A

3.100000s

set_new_be_2_both

Passed

N/A

3.197082s

set_new_be_2_both_log

Passed

N/A

3.372558s

set_new_be_2_group

Passed

N/A

3.030000s

set_new_be_2_user

Passed

N/A

3.143869s

set_new_le_1_both

Passed

N/A

3.200000s

set_new_le_1_both_log

Passed

N/A

3.350000s

set_new_le_1_group

Passed

N/A

3.270092s

set_new_le_1_user

Passed

N/A

3.151761s

set_new_le_2_both

Passed

N/A

3.088673s

set_new_le_2_both_log

Passed

N/A

3.286389s

set_new_le_2_group

Passed

N/A

3.040000s

set_new_le_2_user

Passed

N/A

3.110000s

fs/ffs/t_quotalimit

81.454104s

herit_defq_le_1_group

Passed

N/A

4.050000s

herit_defq_le_1_group_log

Passed

N/A

4.239544s

herit_defq_le_1_user

Passed

N/A

4.070000s

herit_defq_le_1_user_log

Passed

N/A

4.260000s

herit_idefq_le_1_group_log

Passed

N/A

4.160000s

herit_idefq_le_1_user_log

Passed

N/A

4.380000s

inolimit_le_1_group

Passed

N/A

4.050000s

inolimit_le_1_group_log

Passed

N/A

3.950000s

inolimit_le_1_user

Passed

N/A

4.040000s

inolimit_le_1_user_log

Passed

N/A

3.930000s

limit_le_1_group

Passed

N/A

3.986417s

limit_le_1_group_log

Passed

N/A

3.910000s

limit_le_1_user

Passed

N/A

4.050000s

limit_le_1_user_log

Passed

N/A

3.978805s

sinolimit_le_1_group

Passed

N/A

5.990000s

sinolimit_le_1_user

Passed

N/A

5.890000s

slimit_le_1_group

Passed

N/A

5.980000s

slimit_le_1_user

Passed

N/A

6.030000s

fs/ffs/t_clearquota

56.547477s

clear_be_1_both

Passed

N/A

3.728033s

clear_be_1_both_log

Passed

N/A

3.865072s

clear_be_1_group

Passed

N/A

3.267632s

clear_be_1_user

Passed

N/A

3.279752s

clear_be_2_both

Passed

N/A

3.934314s

clear_be_2_both_log

Passed

N/A

3.948654s

clear_be_2_group

Passed

N/A

3.190000s

clear_be_2_user

Passed

N/A

3.110000s

clear_le_1_both

Passed

N/A

3.659780s

clear_le_1_both_log

Passed

N/A

3.918442s

clear_le_1_group

Passed

N/A

3.130000s

clear_le_1_user

Passed

N/A

3.150000s

clear_le_2_both

Passed

N/A

3.590000s

clear_le_2_both_log

Passed

N/A

3.980000s

clear_le_2_group

Passed

N/A

3.185202s

clear_le_2_user

Passed

N/A

3.232584s

fs/ffs/t_miscquota

46.600000s

log_unlink

Passed

N/A

3.062885s

log_unlink_remount

Passed

N/A

3.150000s

npsnapshot_unconf_user

Passed

N/A

4.540000s

npsnapshot_user

Passed

N/A

4.537295s

psnapshot_unconf_user

Passed

N/A

4.672148s

psnapshot_user

Passed

N/A

4.480000s

walk_list_user

Passed

N/A

21.970000s

fs/fifofs/t_fifo

0.611347s

parent_child

Passed

N/A

0.608676s

fs/hfs/t_pathconvert

0.730000s

colonslash

Passed

N/A

0.691179s

fs/kernfs/t_basic

0.650000s

getdents

Passed

N/A

0.310000s

hostname

Passed

N/A

0.316274s

fs/lfs/t_pr

2.462897s

mknod

Passed

N/A

2.398542s

fs/msdosfs/t_snapshot

3.146120s

snapshot

Passed

N/A

3.119350s

fs/nfs/t_mountd

13.360000s

mountdhup

Expected failure

PR kern/5844: race did not trigger this time

13.311997s

fs/nfs/t_rquotad

65.400000s

get_nfs_be_1_both

Passed

N/A

11.370000s

get_nfs_be_1_group

Passed

N/A

11.981091s

get_nfs_be_1_user

Passed

N/A

10.545267s

get_nfs_le_1_both

Passed

N/A

11.600000s

get_nfs_le_1_group

Passed

N/A

10.120000s

get_nfs_le_1_user

Passed

N/A

9.620000s

fs/nullfs/t_basic

0.590000s

basic

Passed

N/A

0.310000s

twistymount

Passed

N/A

0.240000s

fs/psshfs/t_psshfs

31.780000s

inode_nos

Passed

N/A

14.710000s

ls

Passed

N/A

7.480000s

pwd

Passed

N/A

9.480000s

fs/ptyfs/t_ptyfs

0.350000s

basic

Passed

N/A

0.330000s

fs/ptyfs/t_nullpts

0.281037s

nullrevoke

Passed

N/A

0.278631s

fs/puffs/t_basic

5.250000s

inactive_basic

Passed

N/A

0.625209s

inactive_reclaim

Passed

N/A

0.592529s

mount

Passed

N/A

0.440039s

reclaim_hardlink

Passed

N/A

0.483370s

root_chrdev

Passed

N/A

0.470000s

root_fifo

Passed

N/A

0.511917s

root_lnk

Passed

N/A

0.376848s

root_reg

Passed

N/A

0.600000s

signals

Passed

N/A

0.559030s

unlink_accessible

Passed

N/A

0.517511s

fs/puffs/t_fuzz

9.810000s

mountfuzz0

Passed

N/A

0.790000s

mountfuzz1

Passed

N/A

0.710000s

mountfuzz2

Passed

N/A

0.670000s

mountfuzz3

Passed

N/A

0.680000s

mountfuzz4

Passed

N/A

0.667000s

mountfuzz5

Passed

N/A

0.700000s

mountfuzz6

Passed

N/A

0.686925s

mountfuzz7

Passed

N/A

2.949459s

mountfuzz8

Passed

N/A

1.920000s

fs/puffs/t_io

0.820000s

nocache

Passed

N/A

0.800000s

fs/tmpfs/t_renamerace

4.336671s

renamerace2

Passed

N/A

4.310000s

fs/tmpfs/t_create

5.870000s

attrs

Passed

N/A

3.116320s

create

Passed

N/A

1.263215s

kqueue

Passed

N/A

1.430744s

fs/tmpfs/t_devices

1.922995s

basic

Passed

N/A

1.890000s

fs/tmpfs/t_dots

2.568170s

nesteddir

Passed

N/A

1.325513s

topdir

Passed

N/A

1.191284s

fs/tmpfs/t_exec

1.280000s

basic

Passed

N/A

1.260000s

fs/tmpfs/t_link

5.599949s

basic

Passed

N/A

1.790000s

kqueue

Passed

N/A

1.930000s

subdirs

Passed

N/A

1.810000s

fs/tmpfs/t_mkdir

32.630000s

attrs

Passed

N/A

2.472396s

kqueue

Passed

N/A

1.570000s

many

Passed

N/A

25.940000s

nested

Passed

N/A

1.190000s

single

Passed

N/A

1.381625s

fs/tmpfs/t_mknod

7.775596s

block

Passed

N/A

1.160603s

block_kqueue

Passed

N/A

1.386462s

char

Passed

N/A

1.110000s

char_kqueue

Passed

N/A

1.424667s

pipe

Passed

N/A

1.200000s

pipe_kqueue

Passed

N/A

1.401877s

fs/tmpfs/t_mount

6.590000s

attrs

Passed

N/A

1.097668s

large

Passed

N/A

1.226893s

mntpt

Passed

N/A

1.035488s

negative

Passed

N/A

1.000000s

options

Passed

N/A

1.064615s

plain

Passed

N/A

1.050000s

fs/tmpfs/t_pipes

1.260000s

basic

Passed

N/A

1.240000s

fs/tmpfs/t_read_write

3.120000s

basic

Passed

N/A

1.437917s

kqueue

Passed

N/A

1.635019s

fs/tmpfs/t_readdir

13.670000s

caching

Passed

N/A

1.390000s

dots

Passed

N/A

1.360000s

many

Passed

N/A

9.010000s

types

Passed

N/A

1.850000s

fs/tmpfs/t_remove

5.896733s

dot

Passed

N/A

1.267537s

kqueue

Passed

N/A

1.610000s

single

Passed

N/A

1.360000s

uchg

Passed

N/A

1.600000s

fs/tmpfs/t_rename

17.580490s

basic

Passed

N/A

1.424418s

crossdev

Passed

N/A

1.424971s

dir_to_emptydir

Passed

N/A

1.679183s

dir_to_file

Passed

N/A

1.550000s

dir_to_fulldir

Passed

N/A

2.020000s

dotdot

Passed

N/A

3.070000s

dots

Passed

N/A

1.387398s

file_to_dir

Passed

N/A

1.600000s

kqueue

Passed

N/A

3.255062s

fs/tmpfs/t_rmdir

12.550000s

curdir

Passed

N/A

1.406897s

dots

Passed

N/A

1.330556s

kqueue

Passed

N/A

1.647444s

links

Passed

N/A

1.519658s

mntpt

Passed

N/A

1.190029s

nested

Passed

N/A

1.330000s

non_empty

Passed

N/A

1.630000s

non_existent

Passed

N/A

1.121662s

single

Passed

N/A

1.222406s

fs/tmpfs/t_setattr

13.790000s

chgrp

Passed

N/A

1.253565s

chgrp_kqueue

Passed

N/A

1.450000s

chmod

Passed

N/A

1.300000s

chmod_kqueue

Passed

N/A

1.400000s

chown

Passed

N/A

1.354381s

chown_kqueue

Passed

N/A

1.430000s

chowngrp

Passed

N/A

1.210000s

chowngrp_kqueue

Passed

N/A

1.410000s

chtimes

Passed

N/A

1.370000s

chtimes_kqueue

Passed

N/A

1.460000s

fs/tmpfs/t_sizes

6.124027s

big

Passed

N/A

1.620000s

overflow

Passed

N/A

1.967878s

overwrite

Passed

N/A

1.410000s

small

Passed

N/A

1.070000s

fs/tmpfs/t_sockets

1.540000s

basic

Passed

N/A

1.490000s

fs/tmpfs/t_statvfs

1.063420s

values

Passed

N/A

1.050000s

fs/tmpfs/t_symlink

5.990270s

dir

Passed

N/A

1.580000s

exec

Passed

N/A

1.300000s

file

Passed

N/A

1.493855s

kqueue

Passed

N/A

1.560000s

fs/tmpfs/t_times

10.630648s

empty

Passed

N/A

3.400000s

link

Passed

N/A

2.330000s

non_empty

Passed

N/A

2.320000s

rename

Passed

N/A

2.530000s

fs/tmpfs/t_trail_slash

1.465179s

main

Passed

N/A

1.437046s

fs/tmpfs/t_truncate

1.363699s

basic

Passed

N/A

1.339755s

fs/tmpfs/t_vnd

13.940409s

basic

Passed

N/A

13.910000s

fs/tmpfs/t_vnode_leak

60.270000s

main

Passed

N/A

60.251282s

fs/umapfs/t_basic

0.360000s

basic

Passed

N/A

0.333722s

fs/union/t_pr

0.910000s

devnull1

Passed

N/A

0.350642s

devnull2

Passed

N/A

0.270000s

multilayer

Passed

N/A

0.268843s

fs/vfs/t_full

71.170000s

ext2fs_fillfs

Passed

N/A

3.090000s

ffs_fillfs

Passed

N/A

1.810000s

ffslog_fillfs

Passed

N/A

1.750000s

lfs_fillfs

Passed

N/A

9.200000s

msdosfs_fillfs

Passed

N/A

1.805388s

nfs_fillfs

Passed

N/A

13.197390s

p2k_ffs_fillfs

Skipped

fs does not support explicit block allocation (GOP_ALLOC)

1.924314s

puffs_fillfs

Skipped

fs does not support explicit block allocation (GOP_ALLOC)

0.840000s

rumpfs_fillfs

Skipped

fs does not support explicit block allocation (GOP_ALLOC)

0.630000s

sysvbfs_fillfs

Passed

N/A

5.650000s

tmpfs_fillfs

Passed

N/A

1.092210s

v7fs_fillfs

Passed

N/A

29.721896s

fs/vfs/t_io

118.370000s

ext2fs_extendfile

Passed

N/A

1.391221s

ext2fs_extendfile_append

Passed

N/A

0.973638s

ext2fs_holywrite

Passed

N/A

0.980000s

ext2fs_overwrite512

Passed

N/A

1.010000s

ext2fs_overwrite64k

Passed

N/A

1.020000s

ext2fs_overwrite_trunc

Passed

N/A

1.030000s

ext2fs_shrinkfile

Passed

N/A

1.000000s

ffs_extendfile

Passed

N/A

1.100000s

ffs_extendfile_append

Passed

N/A

1.040000s

ffs_holywrite

Passed

N/A

1.047874s

ffs_overwrite512

Passed

N/A

1.060000s

ffs_overwrite64k

Passed

N/A

1.065987s

ffs_overwrite_trunc

Passed

N/A

1.083856s

ffs_shrinkfile

Passed

N/A

1.030000s

ffslog_extendfile

Passed

N/A

1.170000s

ffslog_extendfile_append

Passed

N/A

1.120000s

ffslog_holywrite

Passed

N/A

1.159189s

ffslog_overwrite512

Passed

N/A

1.100000s

ffslog_overwrite64k

Passed

N/A

1.155526s

ffslog_overwrite_trunc

Passed

N/A

1.140000s

ffslog_shrinkfile

Passed

N/A

1.146317s

lfs_extendfile

Passed

N/A

3.180000s

lfs_extendfile_append

Passed

N/A

2.890000s

lfs_holywrite

Passed

N/A

2.988691s

lfs_overwrite512

Passed

N/A

2.964631s

lfs_overwrite64k

Passed

N/A

3.013763s

lfs_overwrite_trunc

Passed

N/A

3.140000s

lfs_shrinkfile

Passed

N/A

2.778998s

msdosfs_extendfile

Passed

N/A

1.040000s

msdosfs_extendfile_append

Passed

N/A

0.971371s

msdosfs_holywrite

Passed

N/A

0.960000s

msdosfs_overwrite512

Passed

N/A

0.960000s

msdosfs_overwrite64k

Passed

N/A

1.000000s

msdosfs_overwrite_trunc

Passed

N/A

0.980000s

msdosfs_shrinkfile

Passed

N/A

0.950000s

nfs_extendfile

Passed

N/A

2.600000s

nfs_extendfile_append

Passed

N/A

2.300000s

nfs_holywrite

Passed

N/A

3.346344s

nfs_overwrite512

Passed

N/A

3.340000s

nfs_overwrite64k

Passed

N/A

3.977461s

nfs_overwrite_trunc

Passed

N/A

2.434925s

nfs_shrinkfile

Passed

N/A

3.280000s

p2k_ffs_extendfile

Passed

N/A

1.710000s

p2k_ffs_extendfile_append

Passed

N/A

1.736816s

p2k_ffs_holywrite

Passed

N/A

1.727562s

p2k_ffs_overwrite512

Passed

N/A

1.598448s

p2k_ffs_overwrite64k

Passed

N/A

1.740000s

p2k_ffs_overwrite_trunc

Passed

N/A

1.623022s

p2k_ffs_shrinkfile

Passed

N/A

1.590000s

puffs_extendfile

Passed

N/A

1.030000s

puffs_extendfile_append

Passed

N/A

0.940000s

puffs_holywrite

Passed

N/A

0.950000s

puffs_overwrite512

Passed

N/A

0.940000s

puffs_overwrite64k

Passed

N/A

1.118527s

puffs_overwrite_trunc

Passed

N/A

1.090000s

puffs_shrinkfile

Passed

N/A

1.000000s

rumpfs_extendfile

Passed

N/A

0.730000s

rumpfs_extendfile_append

Passed

N/A

0.755174s

rumpfs_holywrite

Passed

N/A

0.679520s

rumpfs_overwrite512

Passed

N/A

0.670000s

rumpfs_overwrite64k

Passed

N/A

0.680000s

rumpfs_overwrite_trunc

Passed

N/A

0.680000s

rumpfs_shrinkfile

Passed

N/A

0.660750s

sysvbfs_extendfile

Passed

N/A

0.950000s

sysvbfs_extendfile_append

Passed

N/A

0.941746s

sysvbfs_holywrite

Passed

N/A

0.932130s

sysvbfs_overwrite512

Passed

N/A

0.960000s

sysvbfs_overwrite64k

Passed

N/A

0.960000s

sysvbfs_overwrite_trunc

Passed

N/A

0.980000s

sysvbfs_shrinkfile

Passed

N/A

0.909825s

tmpfs_extendfile

Passed

N/A

0.792013s

tmpfs_extendfile_append

Passed

N/A

0.710000s

tmpfs_holywrite

Passed

N/A

0.670000s

tmpfs_overwrite512

Passed

N/A

0.671490s

tmpfs_overwrite64k

Passed

N/A

0.673974s

tmpfs_overwrite_trunc

Passed

N/A

0.680000s

tmpfs_shrinkfile

Passed

N/A

0.678385s

v7fs_extendfile

Passed

N/A

1.150000s

v7fs_extendfile_append

Passed

N/A

1.200000s

v7fs_holywrite

Passed

N/A

1.220000s

v7fs_overwrite512

Passed

N/A

1.186172s

v7fs_overwrite64k

Passed

N/A

1.475154s

v7fs_overwrite_trunc

Passed

N/A

1.850000s

v7fs_shrinkfile

Passed

N/A

1.139555s

fs/vfs/t_renamerace

145.900670s

ext2fs_renamerace

Passed

N/A

5.960000s

ext2fs_renamerace_dirs

Passed

N/A

5.980000s

ffs_renamerace

Passed

N/A

6.000000s

ffs_renamerace_dirs

Passed

N/A

6.020000s

ffslog_renamerace

Passed

N/A

6.087439s

ffslog_renamerace_dirs

Passed

N/A

7.720000s

lfs_renamerace

Passed

N/A

8.150000s

lfs_renamerace_dirs

Passed

N/A

8.000000s

msdosfs_renamerace

Expected failure

PR kern/44661: unmount failed: Device busy

5.991061s

msdosfs_renamerace_dirs

Expected signal

PR kern/43626

8.468500s

nfs_renamerace

Passed

N/A

7.970984s

nfs_renamerace_dirs

Passed

N/A

11.120000s

p2k_ffs_renamerace

Passed

N/A

6.690000s

p2k_ffs_renamerace_dirs

Passed

N/A

6.726895s

puffs_renamerace

Passed

N/A

6.379456s

puffs_renamerace_dirs

Passed

N/A

5.893898s

rumpfs_renamerace

Skipped

rename not supported by file system

0.780000s

rumpfs_renamerace_dirs

Skipped

rename not supported by file system

0.672370s

sysvbfs_renamerace

Passed

N/A

5.890000s

sysvbfs_renamerace_dirs

Skipped

directories not supported by file system

0.834060s

tmpfs_renamerace

Passed

N/A

5.781504s

tmpfs_renamerace_dirs

Passed

N/A

5.655145s

v7fs_renamerace

Passed

N/A

6.235531s

v7fs_renamerace_dirs

Passed

N/A

6.280000s

fs/vfs/t_ro

86.690000s

ext2fs_attrs

Passed

N/A

1.080000s

ext2fs_create

Passed

N/A

0.950000s

ext2fs_createdir

Passed

N/A

0.960000s

ext2fs_createfifo

Passed

N/A

0.920000s

ext2fs_createlink

Passed

N/A

0.970263s

ext2fs_createsymlink

Passed

N/A

0.957723s

ext2fs_fileio

Passed

N/A

0.980000s

ext2fs_rmfile

Passed

N/A

0.971388s

ffs_attrs

Passed

N/A

1.060624s

ffs_create

Passed

N/A

0.990000s

ffs_createdir

Passed

N/A

1.040000s

ffs_createfifo

Passed

N/A

1.050000s

ffs_createlink

Passed

N/A

1.031207s

ffs_createsymlink

Passed

N/A

1.040000s

ffs_fileio

Passed

N/A

1.030000s

ffs_rmfile

Passed

N/A

1.010000s

ffslog_attrs

Passed

N/A

1.165395s

ffslog_create

Passed

N/A

1.060000s

ffslog_createdir

Passed

N/A

1.085376s

ffslog_createfifo

Passed

N/A

1.087102s

ffslog_createlink

Passed

N/A

1.100000s

ffslog_createsymlink

Passed

N/A

1.120000s

ffslog_fileio

Passed

N/A

1.060000s

ffslog_rmfile

Passed

N/A

1.097060s

msdosfs_attrs

Passed

N/A

0.990000s

msdosfs_create

Passed

N/A

0.896004s

msdosfs_createdir

Passed

N/A

0.900000s

msdosfs_createfifo

Passed

N/A

0.900000s

msdosfs_createlink

Passed

N/A

0.960000s

msdosfs_createsymlink

Passed

N/A

0.917260s

msdosfs_fileio

Passed

N/A

0.970000s

msdosfs_rmfile

Passed

N/A

0.960000s

nfs_attrs

Passed

N/A

2.288943s

nfs_create

Passed

N/A

2.201595s

nfs_createdir

Passed

N/A

2.174371s

nfs_createfifo

Passed

N/A

2.170000s

nfs_createlink

Passed

N/A

2.440000s

nfs_createsymlink

Passed

N/A

2.200000s

nfs_fileio

Passed

N/A

2.250000s

nfs_rmfile

Passed

N/A

2.390000s

nfsro_attrs

Passed

N/A

2.310000s

nfsro_create

Passed

N/A

2.520000s

nfsro_createdir

Passed

N/A

2.285632s

nfsro_createfifo

Passed

N/A

2.230000s

nfsro_createlink

Passed

N/A

2.250000s

nfsro_createsymlink

Passed

N/A

2.180000s

nfsro_fileio

Passed

N/A

2.300000s

nfsro_rmfile

Passed

N/A

2.380000s

sysvbfs_attrs

Passed

N/A

0.950000s

sysvbfs_create

Passed

N/A

0.875506s

sysvbfs_createdir

Passed

N/A

0.730000s

sysvbfs_createfifo

Passed

N/A

0.870000s

sysvbfs_createlink

Passed

N/A

0.830000s

sysvbfs_createsymlink

Passed

N/A

0.880000s

sysvbfs_fileio

Passed

N/A

0.940000s

sysvbfs_rmfile

Passed

N/A

0.910000s

v7fs_attrs

Passed

N/A

1.224842s

v7fs_create

Passed

N/A

1.110000s

v7fs_createdir

Passed

N/A

1.118712s

v7fs_createfifo

Passed

N/A

1.130000s

v7fs_createlink

Passed

N/A

1.163368s

v7fs_createsymlink

Passed

N/A

1.110000s

v7fs_fileio

Passed

N/A

1.160113s

v7fs_rmfile

Passed

N/A

1.166505s

fs/vfs/t_rmdirrace

147.507269s

ext2fs_race

Passed

N/A

10.940000s

ffs_race

Passed

N/A

10.980000s

ffslog_race

Passed

N/A

11.275973s

lfs_race

Passed

N/A

15.031280s

msdosfs_race

Passed

N/A

10.950000s

nfs_race

Passed

N/A

17.850096s

p2k_ffs_race

Passed

N/A

11.512157s

puffs_race

Passed

N/A

12.350000s

rumpfs_race

Passed

N/A

17.756057s

sysvbfs_race

Skipped

directories not supported by file system

0.726493s

tmpfs_race

Passed

N/A

16.712857s

v7fs_race

Passed

N/A

11.090000s

fs/vfs/t_union

37.360000s

ext2fs_basic

Skipped

fs does not support VOP_WHITEOUT

0.944339s

ext2fs_whiteout

Skipped

fs does not support VOP_WHITEOUT

1.190000s

ffs_basic

Passed

N/A

1.510000s

ffs_whiteout

Passed

N/A

1.260000s

ffslog_basic

Passed

N/A

1.120000s

ffslog_whiteout

Passed

N/A

1.280000s

lfs_basic

Passed

N/A

3.090000s

lfs_whiteout

Passed

N/A

3.376780s

msdosfs_basic

Skipped

fs does not support VOP_WHITEOUT

0.905439s

msdosfs_whiteout

Skipped

fs does not support VOP_WHITEOUT

1.160346s

nfs_basic

Skipped

fs does not support VOP_WHITEOUT

2.160000s

nfs_whiteout

Skipped

fs does not support VOP_WHITEOUT

2.460400s

p2k_ffs_basic

Skipped

fs does not support VOP_WHITEOUT

1.398738s

p2k_ffs_whiteout

Skipped

fs does not support VOP_WHITEOUT

4.760000s

puffs_basic

Skipped

fs does not support VOP_WHITEOUT

0.860000s

puffs_whiteout

Skipped

fs does not support VOP_WHITEOUT

1.070000s

rumpfs_basic

Passed

N/A

0.830000s

rumpfs_whiteout

Passed

N/A

1.025314s

sysvbfs_basic

Skipped

fs does not support VOP_WHITEOUT

0.843442s

sysvbfs_whiteout

Skipped

fs does not support VOP_WHITEOUT

1.051041s

tmpfs_basic

Passed

N/A

0.810398s

tmpfs_whiteout

Passed

N/A

1.023291s

v7fs_basic

Skipped

fs does not support VOP_WHITEOUT

1.105523s

v7fs_whiteout

Skipped

fs does not support VOP_WHITEOUT

1.390000s

fs/vfs/t_unpriv

64.430000s

ext2fs_dirperms

Passed

N/A

1.010000s

ext2fs_flags

Passed

N/A

0.990000s

ext2fs_owner

Passed

N/A

0.970000s

ext2fs_times

Passed

N/A

1.010000s

ffs_dirperms

Passed

N/A

1.076528s

ffs_flags

Passed

N/A

1.028355s

ffs_owner

Passed

N/A

0.999308s

ffs_times

Passed

N/A

1.087478s

ffslog_dirperms

Passed

N/A

1.128468s

ffslog_flags

Passed

N/A

1.120000s

ffslog_owner

Passed

N/A

1.110000s

ffslog_times

Passed

N/A

1.110000s

lfs_dirperms

Passed

N/A

3.100000s

lfs_flags

Passed

N/A

2.920000s

lfs_owner

Passed

N/A

2.940000s

lfs_times

Passed

N/A

2.960000s

msdosfs_dirperms

Passed

N/A

0.963813s

msdosfs_flags

Passed

N/A

0.986899s

msdosfs_owner

Skipped

owner not supported by file system

0.890564s

msdosfs_times

Passed

N/A

0.950000s

nfs_dirperms

Passed

N/A

2.330000s

nfs_flags

Skipped

file flags not supported by file system

3.290000s

nfs_owner

Passed

N/A

2.430000s

nfs_times

Passed

N/A

2.440000s

p2k_ffs_dirperms

Passed

N/A

1.840000s

p2k_ffs_flags

Passed

N/A

1.810000s

p2k_ffs_owner

Passed

N/A

1.560000s

p2k_ffs_times

Passed

N/A

1.693453s

puffs_dirperms

Passed

N/A

1.014119s

puffs_flags

Skipped

file flags not supported by file system

0.750000s

puffs_owner

Passed

N/A

1.040000s

puffs_times

Passed

N/A

1.040000s

rumpfs_dirperms

Passed

N/A

0.740000s

rumpfs_flags

Passed

N/A

0.710569s

rumpfs_owner

Passed

N/A

0.660000s

rumpfs_times

Passed

N/A

0.660000s

sysvbfs_dirperms

Skipped

directories not supported by file system

0.800000s

sysvbfs_flags

Skipped

file flags not supported by file system

0.880118s

sysvbfs_owner

Passed

N/A

0.812829s

sysvbfs_times

Passed

N/A

0.924044s

tmpfs_dirperms

Passed

N/A

0.782341s

tmpfs_flags

Passed

N/A

0.706685s

tmpfs_owner

Passed

N/A

0.660000s

tmpfs_times

Passed

N/A

0.664345s

v7fs_dirperms

Passed

N/A

1.160000s

v7fs_flags

Passed

N/A

1.180000s

v7fs_owner

Passed

N/A

1.140000s

v7fs_times

Passed

N/A

1.180000s

fs/vfs/t_vfsops

98.700000s

ext2fs_tfhinval

Passed

N/A

0.961706s

ext2fs_tfhremove

Passed

N/A

1.000000s

ext2fs_tfilehandle

Passed

N/A

1.030000s

ext2fs_tmount

Passed

N/A

1.047993s

ext2fs_tstatvfs

Passed

N/A

0.990000s

ext2fs_tsync

Passed

N/A

1.003478s

ffs_tfhinval

Passed

N/A

1.100000s

ffs_tfhremove

Passed

N/A

1.100000s

ffs_tfilehandle

Passed

N/A

1.040000s

ffs_tmount

Passed

N/A

1.030000s

ffs_tstatvfs

Passed

N/A

1.034229s

ffs_tsync

Passed

N/A

1.060000s

ffslog_tfhinval

Passed

N/A

1.222471s

ffslog_tfhremove

Passed

N/A

1.129183s

ffslog_tfilehandle

Passed

N/A

1.140000s

ffslog_tmount

Passed

N/A

1.130000s

ffslog_tstatvfs

Passed

N/A

1.100000s

ffslog_tsync

Passed

N/A

1.150000s

lfs_tfhinval

Passed

N/A

3.009179s

lfs_tfhremove

Expected failure

fhopen() for removed file succeeds (PR kern/43745): /tmp/bracket/build/2012.06.14.20.18.16-sparc/src/tests/fs/vfs/t_vfsops.c:152: Expected true value in rump_sys_fhopen(fhp, fhsize, O_RDONLY) == -1

2.931820s

lfs_tfilehandle

Passed

N/A

2.850000s

lfs_tmount

Passed

N/A

2.940000s

lfs_tstatvfs

Passed

N/A

2.721685s

lfs_tsync

Passed

N/A

3.234835s

msdosfs_tfhinval

Passed

N/A

0.940000s

msdosfs_tfhremove

Passed

N/A

1.010000s

msdosfs_tfilehandle

Passed

N/A

1.030000s

msdosfs_tmount

Passed

N/A

0.960000s

msdosfs_tstatvfs

Passed

N/A

0.982053s

msdosfs_tsync

Passed

N/A

0.966240s

nfs_tfhinval

Passed

N/A

2.284895s

nfs_tfhremove

Passed

N/A

3.380000s

nfs_tfilehandle

Passed

N/A

3.505501s

nfs_tmount

Passed

N/A

3.382256s

nfs_tstatvfs

Passed

N/A

2.250000s

nfs_tsync

Passed

N/A

3.439928s

p2k_ffs_tfhinval

Passed

N/A

1.620000s

p2k_ffs_tfhremove

Passed

N/A

1.730000s

p2k_ffs_tfilehandle

Passed

N/A

1.783172s

p2k_ffs_tmount

Passed

N/A

1.580000s

p2k_ffs_tstatvfs

Passed

N/A

1.782101s

p2k_ffs_tsync

Passed

N/A

1.680000s

puffs_tfhinval

Passed

N/A

1.110580s

puffs_tfhremove

Passed

N/A

0.850000s

puffs_tfilehandle

Passed

N/A

0.970000s

puffs_tmount

Passed

N/A

1.020000s

puffs_tstatvfs

Passed

N/A

0.830000s

puffs_tsync

Passed

N/A

0.852300s

rumpfs_tfhinval

Skipped

file handles not supported

0.700000s

rumpfs_tfhremove

Skipped

file handles not supported

0.760000s

rumpfs_tfilehandle

Skipped

file handles not supported

0.670000s

rumpfs_tmount

Passed

N/A

0.660000s

rumpfs_tstatvfs

Passed

N/A

0.706086s

rumpfs_tsync

Passed

N/A

0.670000s

sysvbfs_tfhinval

Skipped

file handles not supported

0.842572s

sysvbfs_tfhremove

Skipped

file handles not supported

0.829498s

sysvbfs_tfilehandle

Skipped

file handles not supported

0.909942s

sysvbfs_tmount

Passed

N/A

0.830000s

sysvbfs_tstatvfs

Passed

N/A

0.870000s

sysvbfs_tsync

Passed

N/A

0.720000s

tmpfs_tfhinval

Passed

N/A

0.770000s

tmpfs_tfhremove

Passed

N/A

0.700000s

tmpfs_tfilehandle

Passed

N/A

0.670000s

tmpfs_tmount

Passed

N/A

0.660000s

tmpfs_tstatvfs

Passed

N/A

0.656888s

tmpfs_tsync

Passed

N/A

0.680000s

v7fs_tfhinval

Skipped

file handles not supported

1.106424s

v7fs_tfhremove

Skipped

file handles not supported

1.130000s

v7fs_tfilehandle

Skipped

file handles not supported

1.130000s

v7fs_tmount

Passed

N/A

1.110000s

v7fs_tstatvfs

Passed

N/A

1.110000s

v7fs_tsync

Passed

N/A

1.150000s

fs/vfs/t_vnops

319.880000s

ext2fs_access_simple

Passed

N/A

1.000000s

ext2fs_attrs

Passed

N/A

1.030111s

ext2fs_create_exist

Passed

N/A

1.056648s

ext2fs_create_nametoolong

Passed

N/A

1.120000s

ext2fs_dir_notempty

Passed

N/A

1.147836s

ext2fs_dir_rmdirdotdot

Passed

N/A

1.110000s

ext2fs_dir_simple

Passed

N/A

1.060000s

ext2fs_fcntl_getlock_pids

Passed

N/A

1.100000s

ext2fs_fcntl_lock

Passed

N/A

1.130648s

ext2fs_lookup_complex

Passed

N/A

1.070000s

ext2fs_lookup_simple

Passed

N/A

1.020000s

ext2fs_read_directory

Passed

N/A

1.078365s

ext2fs_rename_dir

Passed

N/A

1.160000s

ext2fs_rename_dotdot

Passed

N/A

1.098533s

ext2fs_rename_nametoolong

Passed

N/A

1.045089s

ext2fs_rename_reg_nodir

Passed

N/A

1.070000s

ext2fs_symlink_root

Passed

N/A

1.060000s

ext2fs_symlink_zerolen

Passed

N/A

1.069236s

ffs_access_simple

Passed

N/A

1.150000s

ffs_attrs

Passed

N/A

1.160000s

ffs_create_exist

Passed

N/A

1.170994s

ffs_create_nametoolong

Passed

N/A

1.078470s

ffs_dir_notempty

Passed

N/A

1.160000s

ffs_dir_rmdirdotdot

Passed

N/A

1.115016s

ffs_dir_simple

Passed

N/A

1.143550s

ffs_fcntl_getlock_pids

Passed

N/A

1.180000s

ffs_fcntl_lock

Passed

N/A

1.190000s

ffs_lookup_complex

Passed

N/A

1.190000s

ffs_lookup_simple

Passed

N/A

1.132426s

ffs_read_directory

Passed

N/A

1.175631s

ffs_rename_dir

Passed

N/A

1.270000s

ffs_rename_dotdot

Passed

N/A

1.203829s

ffs_rename_nametoolong

Passed

N/A

1.180000s

ffs_rename_reg_nodir

Passed

N/A

1.170000s

ffs_symlink_root

Passed

N/A

1.170000s

ffs_symlink_zerolen

Passed

N/A

1.150000s

ffslog_access_simple

Passed

N/A

1.223296s

ffslog_attrs

Passed

N/A

1.210000s

ffslog_create_exist

Passed

N/A

1.286185s

ffslog_create_nametoolong

Passed

N/A

1.170000s

ffslog_dir_notempty

Passed

N/A

1.235334s

ffslog_dir_rmdirdotdot

Passed

N/A

1.240000s

ffslog_dir_simple

Passed

N/A

1.280000s

ffslog_fcntl_getlock_pids

Passed

N/A

1.239060s

ffslog_fcntl_lock

Passed

N/A

1.280000s

ffslog_lookup_complex

Passed

N/A

1.237493s

ffslog_lookup_simple

Passed

N/A

1.246263s

ffslog_read_directory

Passed

N/A

1.194504s

ffslog_rename_dir

Passed

N/A

1.305836s

ffslog_rename_dotdot

Passed

N/A

1.240000s

ffslog_rename_nametoolong

Passed

N/A

1.240000s

ffslog_rename_reg_nodir

Passed

N/A

1.250000s

ffslog_symlink_root

Passed

N/A

1.200000s

ffslog_symlink_zerolen

Passed

N/A

1.251284s

lfs_access_simple

Passed

N/A

3.180000s

lfs_attrs

Passed

N/A

3.120000s

lfs_create_exist

Passed

N/A

2.890000s

lfs_create_nametoolong

Passed

N/A

2.960000s

lfs_dir_notempty

Passed

N/A

2.957833s

lfs_dir_rmdirdotdot

Passed

N/A

3.009723s

lfs_dir_simple

Passed

N/A

2.943174s

lfs_fcntl_getlock_pids

Passed

N/A

2.964728s

lfs_fcntl_lock

Passed

N/A

3.335091s

lfs_lookup_complex

Passed

N/A

2.990000s

lfs_lookup_simple

Passed

N/A

2.920000s

lfs_read_directory

Passed

N/A

3.050000s

lfs_rename_dir

Passed

N/A

3.120000s

lfs_rename_dotdot

Passed

N/A

2.860000s

lfs_rename_nametoolong

Passed

N/A

2.919386s

lfs_rename_reg_nodir

Passed

N/A

2.920000s

lfs_symlink_root

Passed

N/A

2.912937s

lfs_symlink_zerolen

Passed

N/A

2.920000s

msdosfs_access_simple

Passed

N/A

1.060000s

msdosfs_attrs

Passed

N/A

1.056931s

msdosfs_create_exist

Passed

N/A

1.122628s

msdosfs_create_nametoolong

Passed

N/A

1.010000s

msdosfs_dir_notempty

Passed

N/A

1.120761s

msdosfs_dir_rmdirdotdot

Passed

N/A

1.090000s

msdosfs_dir_simple

Passed

N/A

1.080000s

msdosfs_fcntl_getlock_pids

Passed

N/A

1.130390s

msdosfs_fcntl_lock

Passed

N/A

1.097899s

msdosfs_lookup_complex

Passed

N/A

1.040000s

msdosfs_lookup_simple

Passed

N/A

1.040000s

msdosfs_read_directory

Passed

N/A

1.041263s

msdosfs_rename_dir

Passed

N/A

1.180842s

msdosfs_rename_dotdot

Passed

N/A

2.890000s

msdosfs_rename_nametoolong

Passed

N/A

1.080000s

msdosfs_rename_reg_nodir

Passed

N/A

1.082897s

msdosfs_symlink_root

Skipped

symlinks not supported by file system

1.020000s

msdosfs_symlink_zerolen

Skipped

symlinks not supported by file system

1.050000s

nfs_access_simple

Passed

N/A

2.448044s

nfs_attrs

Passed

N/A

3.490000s

nfs_create_exist

Passed

N/A

3.509208s

nfs_create_nametoolong

Passed

N/A

3.420000s

nfs_dir_notempty

Passed

N/A

2.570000s

nfs_dir_rmdirdotdot

Passed

N/A

3.540000s

nfs_dir_simple

Passed

N/A

2.522651s

nfs_fcntl_getlock_pids

Passed

N/A

3.530225s

nfs_fcntl_lock

Passed

N/A

2.562887s

nfs_lookup_complex

Passed

N/A

2.480000s

nfs_lookup_simple

Passed

N/A

3.471139s

nfs_read_directory

Passed

N/A

3.562261s

nfs_rename_dir

Passed

N/A

2.804357s

nfs_rename_dotdot

Passed

N/A

2.485214s

nfs_rename_nametoolong

Passed

N/A

2.470000s

nfs_rename_reg_nodir

Passed

N/A

2.640000s

nfs_symlink_root

Passed

N/A

2.484130s

nfs_symlink_zerolen

Passed

N/A

2.371924s

p2k_ffs_access_simple

Passed

N/A

1.750040s

p2k_ffs_attrs

Passed

N/A

1.830000s

p2k_ffs_create_exist

Passed

N/A

1.875173s

p2k_ffs_create_nametoolong

Passed

N/A

1.684304s

p2k_ffs_dir_notempty

Passed

N/A

1.899024s

p2k_ffs_dir_rmdirdotdot

Passed

N/A

1.890000s

p2k_ffs_dir_simple

Passed

N/A

1.840000s

p2k_ffs_fcntl_getlock_pids

Passed

N/A

1.757978s

p2k_ffs_fcntl_lock

Passed

N/A

1.857663s

p2k_ffs_lookup_complex

Passed

N/A

1.870000s

p2k_ffs_lookup_simple

Passed

N/A

1.880000s

p2k_ffs_read_directory

Passed

N/A

1.780000s

p2k_ffs_rename_dir

Passed

N/A

2.069287s

p2k_ffs_rename_dotdot

Passed

N/A

1.895053s

p2k_ffs_rename_nametoolong

Passed

N/A

1.704865s

p2k_ffs_rename_reg_nodir

Passed

N/A

1.823241s

p2k_ffs_symlink_root

Passed

N/A

1.920000s

p2k_ffs_symlink_zerolen

Passed

N/A

1.862462s

puffs_access_simple

Passed

N/A

1.160000s

puffs_attrs

Passed

N/A

1.103981s

puffs_create_exist

Passed

N/A

1.100000s

puffs_create_nametoolong

Passed

N/A

1.101429s

puffs_dir_notempty

Passed

N/A

1.062676s

puffs_dir_rmdirdotdot

Passed

N/A

1.092265s

puffs_dir_simple

Passed

N/A

1.130000s

puffs_fcntl_getlock_pids

Passed

N/A

1.229387s

puffs_fcntl_lock

Passed

N/A

1.087520s

puffs_lookup_complex

Passed

N/A

1.026282s

puffs_lookup_simple

Passed

N/A

0.990000s

puffs_read_directory

Passed

N/A

1.060000s

puffs_rename_dir

Passed

N/A

1.180000s

puffs_rename_dotdot

Passed

N/A

1.152865s

puffs_rename_nametoolong

Passed

N/A

1.151501s

puffs_rename_reg_nodir

Passed

N/A

1.650480s

puffs_symlink_root

Passed

N/A

1.159412s

puffs_symlink_zerolen

Passed

N/A

1.036057s

rumpfs_access_simple

Passed

N/A

0.820856s

rumpfs_attrs

Passed

N/A

0.807701s

rumpfs_create_exist

Passed

N/A

0.750000s

rumpfs_create_nametoolong

Passed

N/A

0.740000s

rumpfs_dir_notempty

Passed

N/A

0.741267s

rumpfs_dir_rmdirdotdot

Passed

N/A

0.740000s

rumpfs_dir_simple

Passed

N/A

0.741420s

rumpfs_fcntl_getlock_pids

Passed

N/A

0.740000s

rumpfs_fcntl_lock

Passed

N/A

0.740000s

rumpfs_lookup_complex

Passed

N/A

0.739669s

rumpfs_lookup_simple

Passed

N/A

0.910000s

rumpfs_read_directory

Passed

N/A

0.798992s

rumpfs_rename_dir

Skipped

rename not supported by file system

0.738390s

rumpfs_rename_dotdot

Skipped

rename not supported by file system

0.720000s

rumpfs_rename_nametoolong

Skipped

rename not supported by file system

0.730000s

rumpfs_rename_reg_nodir

Skipped

rename not supported by file system

0.720000s

rumpfs_symlink_root

Passed

N/A

0.730000s

rumpfs_symlink_zerolen

Passed

N/A

0.730000s

sysvbfs_access_simple

Passed

N/A

1.190000s

sysvbfs_attrs

Passed

N/A

1.020000s

sysvbfs_create_exist

Passed

N/A

1.010000s

sysvbfs_create_nametoolong

Passed

N/A

1.030000s

sysvbfs_dir_notempty

Skipped

directories not supported by file system

0.944826s

sysvbfs_dir_rmdirdotdot

Skipped

directories not supported by file system

0.990000s

sysvbfs_dir_simple

Skipped

directories not supported by file system

0.948102s

sysvbfs_fcntl_getlock_pids

Passed

N/A

1.092457s

sysvbfs_fcntl_lock

Passed

N/A

1.031080s

sysvbfs_lookup_complex

Skipped

directories not supported by file system

0.960000s

sysvbfs_lookup_simple

Passed

N/A

0.992628s

sysvbfs_read_directory

Passed

N/A

0.990000s

sysvbfs_rename_dir

Skipped

directories not supported by file system

0.950000s

sysvbfs_rename_dotdot

Skipped

directories not supported by file system

0.940000s

sysvbfs_rename_nametoolong

Passed

N/A

1.002963s

sysvbfs_rename_reg_nodir

Passed

N/A

1.020000s

sysvbfs_symlink_root

Skipped

symlinks not supported by file system

0.970000s

sysvbfs_symlink_zerolen

Skipped

symlinks not supported by file system

0.960000s

tmpfs_access_simple

Passed

N/A

0.840000s

tmpfs_attrs

Passed

N/A

0.850000s

tmpfs_create_exist

Passed

N/A

1.320000s

tmpfs_create_nametoolong

Passed

N/A

0.800000s

tmpfs_dir_notempty

Passed

N/A

0.750000s

tmpfs_dir_rmdirdotdot

Passed

N/A

0.750000s

tmpfs_dir_simple

Passed

N/A

0.765786s

tmpfs_fcntl_getlock_pids

Passed

N/A

0.768954s

tmpfs_fcntl_lock

Passed

N/A

0.766463s

tmpfs_lookup_complex

Passed

N/A

0.757115s

tmpfs_lookup_simple

Passed

N/A

0.760000s

tmpfs_read_directory

Passed

N/A

0.917558s

tmpfs_rename_dir

Passed

N/A

0.790262s

tmpfs_rename_dotdot

Passed

N/A

0.750000s

tmpfs_rename_nametoolong

Passed

N/A

1.120000s

tmpfs_rename_reg_nodir

Passed

N/A

0.890000s

tmpfs_symlink_root

Passed

N/A

0.790000s

tmpfs_symlink_zerolen

Passed

N/A

0.750399s

v7fs_access_simple

Passed

N/A

1.230501s

v7fs_attrs

Passed

N/A

1.268247s

v7fs_create_exist

Passed

N/A

1.329338s

v7fs_create_nametoolong

Passed

N/A

1.324583s

v7fs_dir_notempty

Passed

N/A

1.308731s

v7fs_dir_rmdirdotdot

Passed

N/A

1.310000s

v7fs_dir_simple

Passed

N/A

1.260845s

v7fs_fcntl_getlock_pids

Passed

N/A

1.347520s

v7fs_fcntl_lock

Passed

N/A

1.320151s

v7fs_lookup_complex

Passed

N/A

1.239454s

v7fs_lookup_simple

Passed

N/A

1.216737s

v7fs_read_directory

Passed

N/A

1.270000s

v7fs_rename_dir

Passed

N/A

1.470000s

v7fs_rename_dotdot

Passed

N/A

1.352872s

v7fs_rename_nametoolong

Passed

N/A

1.331066s

v7fs_rename_reg_nodir

Passed

N/A

1.310000s

v7fs_symlink_root

Passed

N/A

1.250000s

v7fs_symlink_zerolen

Passed

N/A

1.271266s

games/t_factor

0.040000s

loop

Skipped

Required program '/usr/games/factor' not found in the PATH

0.009666s

overflow

Skipped

Required program '/usr/games/factor' not found in the PATH

0.007813s

include/machine/t_bswap

0.358160s

bswap16_basic

Passed

N/A

0.050000s

bswap16_unconst

Passed

N/A

0.110000s

bswap32_basic

Passed

N/A

0.040000s

bswap32_unconst

Passed

N/A

0.040000s

bswap64_basic

Passed

N/A

0.040000s

bswap64_unconst

Passed

N/A

0.034395s

include/sys/t_bitops

0.390000s

fast_divide32

Passed

N/A

0.042478s

ffsfls

Passed

N/A

0.040000s

ilog2_basic

Passed

N/A

0.040000s

ilog2_log2

Passed

N/A

0.250000s

include/sys/t_bootblock

0.090000s

mbr_partition

Passed

N/A

0.040000s

mbr_sector

Passed

N/A

0.033506s

include/sys/t_cdefs

0.383117s

sissigned

Passed

N/A

0.038561s

stypefit

Passed

N/A

0.077607s

stypemask

Passed

N/A

0.040000s

stypeminmax

Passed

N/A

0.040000s

uissigned

Passed

N/A

0.032579s

utypefit

Passed

N/A

0.040000s

utypemask

Passed

N/A

0.040000s

utypeminmax

Passed

N/A

0.032744s

include/sys/t_socket

0.760000s

cmsg_sendfd

Passed

N/A

0.390000s

cmsg_sendfd_bounds

Passed

N/A

0.340000s

include/sys/t_tree

1.710000s

tree_rbstress

Passed

N/A

1.699135s

include/sys/t_types

0.140000s

types_limits

Passed

N/A

0.050000s

types_signed

Passed

N/A

0.040000s

types_unsigned

Passed

N/A

0.030275s

include/t_bitstring

0.850000s

bits_27

Passed

N/A

0.220000s

bits_32

Passed

N/A

0.150000s

bits_49

Passed

N/A

0.120000s

bits_64

Passed

N/A

0.120000s

bits_67

Passed

N/A

0.120734s

bits_8

Passed

N/A

0.090000s

include/t_errno

0.060000s

errno_constants

Expected failure

PR standards/44921: 2 checks failed as expected; see output for more details

0.051909s

include/t_glob

0.050000s

glob_types

Passed

N/A

0.030000s

include/t_inttypes

0.050000s

int_fmtio

Passed

N/A

0.050000s

include/t_limits

0.150000s

char

Passed

N/A

0.030000s

posix

Passed

N/A

0.030563s

short

Passed

N/A

0.030000s

include/t_netdb

0.050000s

netdb_constants

Expected failure

PR standards/44777: 2 checks failed as expected; see output for more details

0.050000s

include/t_paths

0.040000s

paths

Skipped

PR port-sparc/45580

0.040000s

include/t_stdint

0.090000s

int16

Passed

N/A

0.039546s

int8

Passed

N/A

0.040031s

ipf/t_filter_exec

50.569425s

f1

Passed

N/A

1.420000s

f10

Passed

N/A

3.500000s

f11

Passed

N/A

1.820000s

f12

Passed

N/A

1.610000s

f13

Passed

N/A

2.140532s

f14

Passed

N/A

1.880000s

f15

Passed

N/A

0.780487s

f16

Passed

N/A

0.740000s

f17

Passed

N/A

0.750000s

f18

Skipped

This test case is probably broken

0.390000s

f2

Passed

N/A

1.470000s

f20

Passed

N/A

0.750000s

f24

Passed

N/A

0.760612s

f3

Passed

N/A

1.778383s

f4

Passed

N/A

1.887907s

f5

Passed

N/A

7.850000s

f6

Passed

N/A

7.920000s

f7

Passed

N/A

2.034755s

f8

Passed

N/A

1.612188s

f9

Passed

N/A

3.320000s

ipv6_1

Passed

N/A

1.010000s

ipv6_2

Passed

N/A

1.310000s

ipv6_3

Passed

N/A

1.050000s

ipv6_5

Passed

N/A

1.040000s

ipv6_6

Passed

N/A

1.138708s

ipf/t_filter_parse

14.490000s

i1

Passed

N/A

0.622881s

i10

Passed

N/A

0.680000s

i11

Passed

N/A

0.700000s

i12

Passed

N/A

0.670000s

i13

Passed

N/A

0.651299s

i14

Passed

N/A

0.640000s

i15

Passed

N/A

0.620000s

i16

Passed

N/A

0.670000s

i17

Skipped

This test case is probably broken

0.387477s

i18

Passed

N/A

0.560000s

i19

Passed

N/A

1.070000s

i2

Passed

N/A

0.719216s

i20

Passed

N/A

0.686938s

i21

Passed

N/A

0.630000s

i3

Passed

N/A

0.640000s

i4

Passed

N/A

0.710000s

i5

Passed

N/A

0.680000s

i6

Passed

N/A

0.640000s

i7

Passed

N/A

0.692805s

i8

Passed

N/A

0.720000s

i9

Passed

N/A

0.677746s

ipf/t_logging

1.329930s

l1

Failed

atf-check failed; see the output of the test for details

1.267072s

ipf/t_nat_exec

3.960000s

n10

Skipped

This test case is probably broken

0.260892s

n12

Skipped

This test case is probably broken

0.250000s

n13

Skipped

This test case is probably broken

0.250000s

n14

Skipped

This test case is probably broken

0.250000s

n16

Passed

N/A

0.770146s

n17

Passed

N/A

0.850000s

n3

Skipped

This test case is probably broken

0.370000s

n7

Skipped

This test case is probably broken

0.310000s

n8

Skipped

This test case is probably broken

0.250000s

n9

Skipped

This test case is probably broken

0.260000s

ipf/t_nat_ipf_exec

5.012482s

ni1

Skipped

This test case is probably broken

0.260000s

ni13

Skipped

This test case is probably broken

0.262584s

ni14

Skipped

This test case is probably broken

0.260000s

ni15

Skipped

This test case is probably broken

0.262880s

ni16

Skipped

This test case is probably broken

0.330646s

ni2

Skipped

This test case is probably broken

0.321009s

ni21

Passed

N/A

0.710000s

ni23

Passed

N/A

0.790000s

ni3

Skipped

This test case is probably broken

0.370000s

ni4

Skipped

This test case is probably broken

0.260000s

ni6

Skipped

This test case is probably broken

0.254567s

ni7

Skipped

This test case is probably broken

0.252278s

ni8

Skipped

This test case is probably broken

0.250815s

ni9

Skipped

This test case is probably broken

0.290000s

ipf/t_nat_parse

3.270000s

in1

Passed

N/A

0.650000s

in3

Passed

N/A

0.610000s

in4

Passed

N/A

0.610000s

in5

Passed

N/A

0.680000s

in6

Passed

N/A

0.640000s

ipf/t_pools

4.470000s

ip1

Passed

N/A

0.670000s

ip2

Passed

N/A

0.650000s

p1

Passed

N/A

0.757006s

p2

Passed

N/A

0.731063s

p3

Passed

N/A

0.750000s

p5

Passed

N/A

0.765931s

kernel/kqueue/read/t_fifo

0.054277s

fifo

Passed

N/A

0.050000s

kernel/kqueue/read/t_file

6.115464s

file

Passed

N/A

6.100990s

kernel/kqueue/read/t_file2

0.045739s

file2

Passed

N/A

0.031592s

kernel/kqueue/read/t_pipe

0.041585s

pipe

Passed

N/A

0.040000s

kernel/kqueue/read/t_ttypty

2.184768s

master

Passed

N/A

1.104514s

slave

Passed

N/A

1.050000s

kernel/kqueue/write/t_fifo

0.060000s

fifo

Passed

N/A

0.048606s

kernel/kqueue/write/t_pipe

0.130000s

pipe1

Passed

N/A

0.038135s

pipe2

Passed

N/A

0.048620s

pipe3

Passed

N/A

0.035162s

kernel/kqueue/write/t_ttypty

2.128346s

master

Passed

N/A

1.060000s

slave

Passed

N/A

1.060000s

kernel/kqueue/t_ioctl

0.090000s

kfilter_byfilter

Passed

N/A

0.040000s

kfilter_byname

Passed

N/A

0.040000s

kernel/kqueue/t_proc1

2.100000s

proc1

Passed

N/A

2.100000s

kernel/kqueue/t_proc2

2.041527s

proc2

Passed

N/A

2.040000s

kernel/kqueue/t_sig

12.110000s

sig

Passed

N/A

12.102486s

kernel/tty/t_pr

0.850000s

client_first

Passed

N/A

0.336408s

master_first

Passed

N/A

0.266734s

ptyioctl

Passed

N/A

0.230000s

kernel/t_lock

1.030927s

lock

Passed

N/A

1.030000s

kernel/t_pty

6.163384s

pty_no_queue

Passed

N/A

3.080000s

pty_queue

Passed

N/A

3.073583s

kernel/t_rnd

0.620000s

RNDADDDATA

Passed

N/A

0.325219s

RNDADDDATA2

Passed

N/A

0.267927s

kernel/t_extattrctl

0.246421s

extattrctl_namei

Passed

N/A

0.240000s

kernel/t_filedesc

8.080000s

getfilerace

Passed

N/A

8.060000s

kernel/t_subr_prf

0.157380s

snprintf_count

Passed

N/A

0.040000s

snprintf_count_overflow

Passed

N/A

0.035450s

snprintf_print

Passed

N/A

0.037770s

snprintf_print_overflow

Passed

N/A

0.030000s

kernel/t_extent

0.457244s

bound1

Passed

N/A

0.033411s

bound2

Passed

N/A

0.052644s

bound3

Passed

N/A

0.032011s

bound4

Passed

N/A

0.033205s

bound5

Passed

N/A

0.034110s

coalesce

Passed

N/A

0.035490s

free

Passed

N/A

0.036718s

subregion1

Passed

N/A

0.037890s

subregion2

Passed

N/A

0.040000s

subregion3

Passed

N/A

0.040000s

subregion4

Passed

N/A

0.040000s

kernel/t_umount

4.250000s

umount

Passed

N/A

4.210000s

kernel/t_ps_strings

3.442621s

update

Passed

N/A

2.840732s

validate

Passed

N/A

0.560000s

lib/csu/t_crt0

2.665515s

initfini1

Passed

N/A

0.603868s

initfini2

Passed

N/A

0.570000s

initfini3

Passed

N/A

0.644188s

initfini4

Passed

N/A

0.719362s

lib/libbluetooth/t_bluetooth

0.100000s

check_bt_aton

Passed

N/A

0.059883s

check_bt_ntoa

Passed

N/A

0.040000s

lib/libbluetooth/t_sdp_data

0.093938s

check_sdp_data_size

Passed

N/A

0.047304s

check_sdp_data_type

Passed

N/A

0.039862s

lib/libbluetooth/t_sdp_get

0.420000s

check_sdp_get_alt

Passed

N/A

0.040000s

check_sdp_get_attr

Passed

N/A

0.040000s

check_sdp_get_bool

Passed

N/A

0.032688s

check_sdp_get_data

Passed

N/A

0.037565s

check_sdp_get_int

Passed

N/A

0.040000s

check_sdp_get_seq

Passed

N/A

0.040000s

check_sdp_get_str

Passed

N/A

0.040000s

check_sdp_get_uint

Passed

N/A

0.031860s

check_sdp_get_url

Passed

N/A

0.039467s

check_sdp_get_uuid

Passed

N/A

0.040000s

lib/libbluetooth/t_sdp_match

0.040403s

check_sdp_match_uuid16

Passed

N/A

0.032455s

lib/libbluetooth/t_sdp_put

0.970000s

check_sdp_put_alt

Passed

N/A

0.090000s

check_sdp_put_attr

Passed

N/A

0.040000s

check_sdp_put_bool

Passed

N/A

0.038879s

check_sdp_put_data

Passed

N/A

0.039957s

check_sdp_put_int

Passed

N/A

0.040000s

check_sdp_put_int16

Passed

N/A

0.040000s

check_sdp_put_int32

Passed

N/A

0.040000s

check_sdp_put_int64

Passed

N/A

0.033228s

check_sdp_put_int8

Passed

N/A

0.046681s

check_sdp_put_seq

Passed

N/A

0.032516s

check_sdp_put_str

Passed

N/A

0.036622s

check_sdp_put_uint

Passed

N/A

0.040000s

check_sdp_put_uint16

Passed

N/A

0.040000s

check_sdp_put_uint32

Passed

N/A

0.040000s

check_sdp_put_uint64

Passed

N/A

0.040000s

check_sdp_put_uint8

Passed

N/A

0.040000s

check_sdp_put_url

Passed

N/A

0.031952s

check_sdp_put_uuid

Passed

N/A

0.037804s

check_sdp_put_uuid128

Passed

N/A

0.040000s

check_sdp_put_uuid16

Passed

N/A

0.040000s

check_sdp_put_uuid32

Passed

N/A

0.040000s

lib/libbluetooth/t_sdp_set

0.200000s

check_sdp_set_alt

Passed

N/A

0.040000s

check_sdp_set_bool

Passed

N/A

0.039730s

check_sdp_set_int

Passed

N/A

0.039494s

check_sdp_set_seq

Passed

N/A

0.039574s

check_sdp_set_uint

Passed

N/A

0.039429s

lib/libc/db/t_db

178.255612s

alternate_recno

Passed

N/A

1.420000s

big_btree

Passed

N/A

3.856742s

big_hash

Passed

N/A

1.910000s

big_recno

Passed

N/A

4.087053s

bsize_ffactor

Passed

N/A

117.813967s

byte_orders_btree

Passed

N/A

1.264404s

byte_orders_hash

Passed

N/A

1.330000s

cursor_flags_btree

Passed

N/A

1.080599s

cursor_flags_recno

Passed

N/A

1.050000s

delete_btree

Passed

N/A

1.125936s

delete_recno

Passed

N/A

1.070000s

duplicate_btree

Passed

N/A

1.090000s

four_char_hash

Passed

N/A

0.780537s

medium_btree

Passed

N/A

0.950000s

medium_hash

Passed

N/A

0.874142s

medium_recno

Passed

N/A

0.803149s

random_recno

Passed

N/A

2.541866s

repeated_btree

Passed

N/A

1.551994s

repeated_hash

Passed

N/A

1.470179s

reverse_order_recno

Passed

N/A

1.150000s

reverse_recno

Passed

N/A

1.530000s

small_btree

Passed

N/A

0.847526s

small_hash

Passed

N/A

0.839334s

small_page_btree

Passed

N/A

26.391898s

small_recno

Passed

N/A

0.790000s

lib/libc/gen/posix_spawn/t_spawn

0.330000s

t_spawn_child

Passed

N/A

0.104909s

t_spawn_ls

Passed

N/A

0.037877s

t_spawn_missing

Passed

N/A

0.036784s

t_spawn_nonexec

Passed

N/A

0.050000s

t_spawn_zero

Passed

N/A

0.049686s

t_spawnp_ls

Passed

N/A

0.040000s

lib/libc/gen/posix_spawn/t_fileactions

0.688830s

t_spawn_empty_fileactions

Passed

N/A

0.381820s

t_spawn_fileactions

Passed

N/A

0.057134s

t_spawn_open_nonexistent

Passed

N/A

0.037353s

t_spawn_open_nonexistent_diag

Passed

N/A

0.038132s

t_spawn_openmode

Passed

N/A

0.095570s

t_spawn_reopen

Passed

N/A

0.050000s

lib/libc/gen/posix_spawn/t_spawnattr

0.060000s

t_spawnattr

Passed

N/A

0.060000s

lib/libc/gen/t_alarm

1.127011s

alarm_basic

Passed

N/A

1.036039s

alarm_fork

Passed

N/A

0.036645s

alarm_previous

Passed

N/A

0.030000s

lib/libc/gen/t_assert

0.129284s

assert_false

Passed

N/A

0.040001s

assert_true

Passed

N/A

0.070000s

lib/libc/gen/t_basedirname

0.079712s

basename_posix

Passed

N/A

0.030000s

dirname_posix

Passed

N/A

0.031920s

lib/libc/gen/t_closefrom

0.222814s

closefrom_basic

Passed

N/A

0.064715s

closefrom_buffer

Passed

N/A

0.066473s

closefrom_err

Passed

N/A

0.033964s

closefrom_one

Passed

N/A

0.040000s

lib/libc/gen/t_cpuset

0.120000s

cpuset_err

Passed

N/A

0.040000s

cpuset_set

Passed

N/A

0.039505s

cpuset_size

Passed

N/A

0.036734s

lib/libc/gen/t_dir

0.190000s

seekdir_basic

Passed

N/A

0.040000s

telldir_leak

Passed

N/A

0.141471s

lib/libc/gen/t_fmtcheck

0.040000s

fmtcheck_basic

Passed

N/A

0.039827s

lib/libc/gen/t_fnmatch

0.247832s

fnmatch_backslashes

Passed

N/A

0.033812s

fnmatch_casefold

Passed

N/A

0.035051s

fnmatch_leadingdir

Passed

N/A

0.040000s

fnmatch_noescape

Passed

N/A

0.030000s

fnmatch_pathname

Passed

N/A

0.030000s

fnmatch_period

Passed

N/A

0.031190s

lib/libc/gen/t_fpclassify

0.210000s

fpclassify_double

Passed

N/A

0.084886s

fpclassify_float

Passed

N/A

0.088425s

lib/libc/gen/t_fpsetmask

0.830000s

fpsetmask_basic

Passed

N/A

0.031514s

fpsetmask_masked_double

Passed

N/A

0.168905s

fpsetmask_masked_float

Passed

N/A

0.120000s

fpsetmask_masked_long_double

Passed

N/A

0.120000s

fpsetmask_unmasked_double

Passed

N/A

0.120000s

fpsetmask_unmasked_float

Passed

N/A

0.111582s

fpsetmask_unmasked_long_double

Passed

N/A

0.117277s

lib/libc/gen/t_fpsetround

0.120000s

fpsetround_basic

Passed

N/A

0.094538s

lib/libc/gen/t_ftok

0.120000s

ftok_err

Passed

N/A

0.048129s

ftok_link

Passed

N/A

0.066862s

lib/libc/gen/t_getcwd

0.320000s

getcwd_err

Passed

N/A

0.030000s

getcwd_fts

Passed

N/A

0.270279s

lib/libc/gen/t_getgrent

0.410000s

getgrent_loop

Passed

N/A

0.066895s

getgrent_setgid

Passed

N/A

0.340000s

lib/libc/gen/t_glob

0.087225s

glob_star

Passed

N/A

0.040000s

glob_star_not

Passed

N/A

0.040000s

lib/libc/gen/t_humanize_number

0.096034s

humanize_number_basic

Passed

N/A

0.032823s

humanize_number_big

Passed

N/A

0.040000s

lib/libc/gen/t_isnan

0.080000s

isinf_basic

Passed

N/A

0.039118s

isnan_basic

Passed

N/A

0.030000s

lib/libc/gen/t_nice

0.360000s

nice_err

Passed

N/A

0.060000s

nice_priority

Passed

N/A

0.149813s

nice_root

Passed

N/A

0.040000s

nice_thread

Passed

N/A

0.080000s

lib/libc/gen/t_pause

3.101327s

pause_basic

Passed

N/A

1.050000s

pause_kill

Passed

N/A

2.050000s

lib/libc/gen/t_raise

1.530000s

raise_err

Passed

N/A

0.036905s

raise_ret

Passed

N/A

1.040000s

raise_sig

Passed

N/A

0.130000s

raise_stress

Passed

N/A

0.320000s

lib/libc/gen/t_randomid

29.250000s

randomid_basic

Passed

N/A

29.242467s

lib/libc/gen/t_realpath

0.120000s

realpath_basic

Passed

N/A

0.034162s

realpath_huge

Passed

N/A

0.036345s

realpath_symlink

Passed

N/A

0.040000s

lib/libc/gen/t_setdomainname

0.225344s

setdomainname_basic

Passed

N/A

0.064371s

setdomainname_limit

Passed

N/A

0.063720s

setdomainname_perm

Passed

N/A

0.073342s

lib/libc/gen/t_sethostname

0.220000s

sethostname_basic

Passed

N/A

0.070000s

sethostname_limit

Passed

N/A

0.070000s

sethostname_perm

Passed

N/A

0.077914s

lib/libc/gen/t_siginfo

3.833148s

sigalarm

Passed

N/A

1.060000s

sigbus_adraln

Passed

N/A

0.059616s

sigchild_dump

Passed

N/A

1.080000s

sigchild_kill

Passed

N/A

0.050000s

sigchild_normal

Passed

N/A

1.060000s

sigfpe_flt

Passed

N/A

0.330000s

sigfpe_int

Passed

N/A

0.098797s

sigsegv

Passed

N/A

0.060000s

lib/libc/gen/t_syslog

0.124397s

syslog_pthread

Passed

N/A

0.110000s

lib/libc/gen/t_time

10.220000s

time_copy

Passed

N/A

0.040000s

time_mono

Passed

N/A

10.130000s

time_timeofday

Passed

N/A

0.040000s

lib/libc/gen/t_ttyname

0.190000s

ttyname_err

Passed

N/A

0.051135s

ttyname_r_err

Passed

N/A

0.050000s

ttyname_r_stdin

Passed

N/A

0.040000s

ttyname_stdin

Passed

N/A

0.040000s

lib/libc/gen/t_vis

0.080000s

strunvis_hex

Passed

N/A

0.030000s

strvis_basic

Passed

N/A

0.040000s

lib/libc/hash/t_sha2

0.150000s

t_sha256

Passed

N/A

0.040000s

t_sha384

Passed

N/A

0.040000s

t_sha512

Passed

N/A

0.040000s

lib/libc/hash/t_hash

8.240000s

md5

Passed

N/A

0.613761s

sha1

Passed

N/A

7.600000s

lib/libc/inet/t_inet_network

0.190000s

inet_addr_basic

Passed

N/A

0.050000s

inet_addr_err

Passed

N/A

0.041520s

inet_network_basic

Passed

N/A

0.030000s

inet_network_err

Passed

N/A

0.030000s

lib/libc/locale/t_mbrtowc

0.210000s

mbrtowc_internal

Passed

N/A

0.130000s

mbrtowc_object

Passed

N/A

0.060099s

lib/libc/locale/t_mbstowcs

0.070000s

mbstowcs_basic

Passed

N/A

0.060000s

lib/libc/locale/t_mbtowc

0.160000s

mbtowc

Passed

N/A

0.160000s

lib/libc/locale/t_wcscspn

0.040000s

wcscspn

Passed

N/A

0.040000s

lib/libc/locale/t_wcspbrk

0.040000s

wcspbrk

Passed

N/A

0.030000s

lib/libc/locale/t_wcsspn

0.040000s

wcsspn

Passed

N/A

0.030000s

lib/libc/locale/t_wcstod

2.120000s

wcstod

Passed

N/A

2.110000s

lib/libc/locale/t_wctomb

0.197210s

wcrtomb

Passed

N/A

0.089309s

wcrtomb_state

Passed

N/A

0.042070s

wctomb

Passed

N/A

0.042683s

lib/libc/net/getaddrinfo/t_getaddrinfo

4.620000s

basic

Passed

N/A

0.880000s

empty_hostname

Passed

N/A

0.850000s

empty_servname

Passed

N/A

0.610000s

scopeaddr

Passed

N/A

0.440000s

sock_raw

Passed

N/A

0.700000s

specific

Passed

N/A

0.580000s

unsupported_family

Passed

N/A

0.430705s

lib/libc/net/t_getprotoent

0.351298s

endprotoent_rewind

Passed

N/A

0.040000s

getprotobyname_basic

Passed

N/A

0.040000s

getprotobyname_err

Passed

N/A

0.060552s

getprotobynumber_basic

Passed

N/A

0.040000s

getprotobynumber_err

Passed

N/A

0.050000s

getprotoent_next

Passed

N/A

0.040000s

setprotoent_rewind

Passed

N/A

0.030300s

lib/libc/net/t_ether_aton

0.040000s

tc_ether_aton

Passed

N/A

0.030893s

lib/libc/net/t_nsdispatch

0.570000s

recurse

Passed

N/A

0.550000s

lib/libc/net/t_protoent

0.844197s

protoent

Passed

N/A

0.808120s

lib/libc/net/t_servent

6.199495s

servent

Passed

N/A

6.157806s

lib/libc/regex/t_exhaust

0.030000s

regcomp_too_big

Skipped

Not enough memory; needed 125829120, available 32604160

0.015859s

lib/libc/regex/t_regex

18.264322s

anchor

Passed

N/A

0.890000s

backref

Passed

N/A

0.884770s

basic

Passed

N/A

0.843544s

bracket

Passed

N/A

1.336087s

c_comments

Passed

N/A

0.830000s

complex

Passed

N/A

0.850000s

error

Passed

N/A

1.000000s

meta

Passed

N/A

1.060000s

nospec

Passed

N/A

0.870000s

paren

Passed

N/A

1.010075s

regress

Passed

N/A

0.837145s

repet_bounded

Passed

N/A

1.160000s

repet_multi

Passed

N/A

1.100000s

repet_ordinary

Passed

N/A

0.881770s

startend

Passed

N/A

0.847817s

subexp

Passed

N/A

0.850500s

subtle

Passed

N/A

0.860000s

word_bound

Passed

N/A

0.870000s

zero

Passed

N/A

0.926220s

lib/libc/regex/t_regex_att

4.060000s

basic

Passed

N/A

0.694696s

categorization

Passed

N/A

0.648962s

forcedassoc

Passed

N/A

0.640000s

nullsubexpr

Passed

N/A

0.656141s

repetition

Passed

N/A

0.680000s

rightassoc

Passed

N/A

0.629949s

lib/libc/rpc/t_xdr

0.060000s

xdr

Passed

N/A

0.050000s

lib/libc/setjmp/t_setjmp

0.180000s

_setjmp

Passed

N/A

0.038091s

setjmp

Passed

N/A

0.030000s

sigsetjmp_nosave

Passed

N/A

0.030000s

sigsetjmp_save

Passed

N/A

0.030000s

lib/libc/setjmp/t_threadjmp

0.180000s

_setjmp

Passed

N/A

0.040000s

setjmp

Passed

N/A

0.040000s

sigsetjmp_nosave

Passed

N/A

0.040000s

sigsetjmp_save

Passed

N/A

0.040773s

lib/libc/stdlib/t_abs

0.160000s

abs_basic

Passed

N/A

0.036753s

imaxabs_basic

Passed

N/A

0.030000s

labs_basic

Passed

N/A

0.030000s

llabs_basic

Passed

N/A

0.030000s

lib/libc/stdlib/t_atoi

0.270000s

atof_strtod

Passed

N/A

0.080000s

atoi_strtol

Passed

N/A

0.080000s

atol_strtol

Passed

N/A

0.030000s

atoll_strtoll

Passed

N/A

0.030000s

lib/libc/stdlib/t_div

0.139714s

div_basic

Passed

N/A

0.031611s

ldiv_basic

Passed

N/A

0.040000s

lldiv_basic

Passed

N/A

0.037849s

lib/libc/stdlib/t_getenv

40.660000s

clearenv_basic

Passed

N/A

0.170000s

getenv_basic

Passed

N/A

0.030000s

putenv_basic

Passed

N/A

0.062399s

setenv_basic

Passed

N/A

40.340000s

setenv_mixed

Passed

N/A

0.040000s

lib/libc/stdlib/t_getenv_thread

39.638119s

getenv_r_thread

Passed

N/A

9.630000s

putenv_thread

Passed

N/A

9.990000s

setenv_thread

Passed

N/A

9.990636s

unsetenv_thread

Passed

N/A

9.991606s

lib/libc/stdlib/t_exit

0.323213s

exit_atexit

Passed

N/A

0.070000s

exit_basic

Passed

N/A

0.042283s

exit_status

Passed

N/A

0.090580s

exit_tmpfile

Passed

N/A

0.080000s

lib/libc/stdlib/t_hsearch

0.317065s

hsearch_basic

Passed

N/A

0.033221s

hsearch_duplicate

Passed

N/A

0.035064s

hsearch_nonexistent

Passed

N/A

0.036761s

hsearch_r_basic

Passed

N/A

0.040000s

hsearch_r_duplicate

Passed

N/A

0.040000s

hsearch_r_nonexistent

Passed

N/A

0.040000s

hsearch_r_two

Passed

N/A

0.038300s

hsearch_two

Passed

N/A

0.036275s

lib/libc/stdlib/t_mi_vector_hash

0.040000s

mi_vector_hash_basic

Passed

N/A

0.038594s

lib/libc/stdlib/t_posix_memalign

0.050000s

posix_memalign_basic

Passed

N/A

0.045571s

lib/libc/stdlib/t_random

0.075799s

random_same

Passed

N/A

0.070000s

lib/libc/stdlib/t_strtod

0.534790s

strtod_basic

Passed

N/A

0.065830s

strtod_gherman_bug

Passed

N/A

0.040000s

strtod_hex

Passed

N/A

0.042024s

strtod_inf

Passed

N/A

0.040000s

strtod_nan

Passed

N/A

0.040833s

strtod_round

Passed

N/A

0.040000s

strtod_underflow

Passed

N/A

0.041840s

strtof_inf

Passed

N/A

0.040000s

strtof_nan

Passed

N/A

0.040000s

strtold_inf

Skipped

Requires long double support

0.041742s

strtold_nan

Skipped

Requires long double support

0.040000s

lib/libc/stdlib/t_strtol

0.210000s

strtol_base

Passed

N/A

0.070000s

strtol_case

Passed

N/A

0.035378s

strtol_range

Passed

N/A

0.040000s

strtol_signed

Passed

N/A

0.036380s

lib/libc/stdlib/t_system

0.250000s

system_basic

Passed

N/A

0.250000s

lib/libc/stdlib/t_atexit

0.433807s

atexit

Passed

N/A

0.410000s

lib/libc/stdlib/t_getopt

3.090651s

getopt

Passed

N/A

1.610000s

getopt_long

Passed

N/A

1.440483s

lib/libc/stdio/t_clearerr

0.128303s

clearerr_basic

Passed

N/A

0.045284s

clearerr_err

Passed

N/A

0.030000s

lib/libc/stdio/t_fflush

0.210000s

fflush_err

Passed

N/A

0.060000s

fflush_seek

Passed

N/A

0.070000s

fpurge_err

Passed

N/A

0.070000s

lib/libc/stdio/t_fmemopen

1.401377s

test00

Passed

N/A

0.038705s

test01

Passed

N/A

0.040000s

test02

Passed

N/A

0.040000s

test03

Passed

N/A

0.040000s

test04

Passed

N/A

0.040000s

test05

Passed

N/A

0.038764s

test06

Passed

N/A

0.040000s

test07

Passed

N/A

0.040000s

test08

Passed

N/A

0.045720s

test09

Passed

N/A

0.090000s

test10

Passed

N/A

0.080000s

test11

Passed

N/A

0.070000s

test12

Passed

N/A

0.059372s

test13

Passed

N/A

0.050000s

test14

Passed

N/A

0.050000s

test15

Passed

N/A

0.069753s

test16

Passed

N/A

0.040000s

test17

Passed

N/A

0.050000s

test18

Passed

N/A

0.040000s

test19

Passed

N/A

0.080000s

test20

Passed

N/A

0.040000s

test21

Passed

N/A

0.050000s

test22

Passed

N/A

0.160000s

lib/libc/stdio/t_fopen

0.807865s

fdopen_close

Passed

N/A

0.070000s

fdopen_err

Passed

N/A

0.110000s

fdopen_seek

Passed

N/A

0.070000s

fopen_append

Passed

N/A

0.072307s

fopen_err

Passed

N/A

0.070339s

fopen_mode

Passed

N/A

0.071935s

fopen_perm

Passed

N/A

0.047857s

fopen_regular

Passed

N/A

0.039363s

fopen_seek

Passed

N/A

0.073888s

freopen_std

Passed

N/A

0.150000s

lib/libc/stdio/t_fputc

0.464804s

fputc_basic

Passed

N/A

0.073814s

fputc_err

Passed

N/A

0.070000s

putc_basic

Passed

N/A

0.071197s

putc_err

Passed

N/A

0.069735s

putc_unlocked_basic

Passed

N/A

0.072265s

putc_unlocked_err

Passed

N/A

0.070000s

lib/libc/stdio/t_popen

0.665771s

popen_zeropad

Passed

N/A

0.647994s

lib/libc/stdio/t_printf

9.034303s

snprintf_c99

Passed

N/A

0.040000s

snprintf_dotzero

Passed

N/A

0.055050s

snprintf_float

Passed

N/A

8.758165s

snprintf_posarg

Passed

N/A

0.038239s

snprintf_posarg_error

Passed

N/A

0.038381s

snprintf_posarg_width

Passed

N/A

0.038757s

sprintf_zeropad

Passed

N/A

0.039789s

lib/libc/stdio/t_scanf

0.082172s

sscanf_neghex

Passed

N/A

0.040000s

sscanf_whitespace

Passed

N/A

0.040000s

lib/libc/string/t_memchr

0.124516s

memchr_basic

Passed

N/A

0.031815s

memchr_simple

Passed

N/A

0.030791s

memrchr_simple

Passed

N/A

0.031092s

lib/libc/string/t_memcpy

10.594488s

memccpy_simple

Passed

N/A

0.035175s

memcpy_basic

Passed

N/A

10.537716s

lib/libc/string/t_memmem

0.050177s

memmem_basic

Passed

N/A

0.040000s

lib/libc/string/t_memset

0.213727s

memset_array

Passed

N/A

0.070000s

memset_basic

Passed

N/A

0.035907s

memset_nonzero

Passed

N/A

0.040000s

memset_struct

Passed

N/A

0.031351s

lib/libc/string/t_popcount

0.082223s

popcount_basic

Skipped

config variable "run_popcount" not set to YES/TRUE

0.031153s

popcountll_basic

Skipped

config variable "run_popcount" not set to YES/TRUE

0.031240s

lib/libc/string/t_strcat

0.105097s

strcat_basic

Passed

N/A

0.058744s

strncat_simple

Passed

N/A

0.030000s

lib/libc/string/t_strchr

0.050000s

strchr_basic

Passed

N/A

0.039461s

lib/libc/string/t_strcmp

0.078021s

strcmp_basic

Passed

N/A

0.034723s

strcmp_simple

Passed

N/A

0.030000s

lib/libc/string/t_strcpy

0.040000s

strcpy_basic

Passed

N/A

0.033189s

lib/libc/string/t_strcspn

0.040000s

strcspn

Passed

N/A

0.040000s

lib/libc/string/t_strerror

0.340000s

strerror_basic

Passed

N/A

0.130000s

strerror_err

Passed

N/A

0.040000s

strerror_r_basic

Passed

N/A

0.126175s

strerror_r_err

Passed

N/A

0.040000s

lib/libc/string/t_stresep

0.040000s

stresep_basic

Passed

N/A

0.037441s

lib/libc/string/t_strlen

0.663326s

strlen_basic

Passed

N/A

0.030000s

strlen_huge

Passed

N/A

0.581666s

strnlen_basic

Passed

N/A

0.039165s

lib/libc/string/t_strpbrk

0.040000s

strpbrk

Passed

N/A

0.036075s

lib/libc/string/t_strrchr

0.040000s

strrchr_basic

Passed

N/A

0.035710s

lib/libc/string/t_strspn

0.040000s

strspn

Passed

N/A

0.036637s

lib/libc/string/t_swab

0.040000s

swab_basic

Passed

N/A

0.035783s

lib/libc/sys/t_access

0.280000s

access_access

Passed

N/A

0.080000s

access_fault

Passed

N/A

0.040000s

access_inval

Passed

N/A

0.040000s

access_notdir

Passed

N/A

0.040000s

access_notexist

Passed

N/A

0.040000s

access_toolong

Passed

N/A

0.040000s

lib/libc/sys/t_chroot

0.289280s

chroot_basic

Passed

N/A

0.046086s

chroot_err

Passed

N/A

0.039849s

chroot_perm

Passed

N/A

0.048960s

fchroot_basic

Passed

N/A

0.040000s

fchroot_err

Passed

N/A

0.038515s

fchroot_perm

Passed

N/A

0.050000s

lib/libc/sys/t_clock_gettime

11.864113s

clock_gettime_real

Passed

N/A

11.835727s

lib/libc/sys/t_clone

0.170000s

clone_basic

Passed

N/A

0.040000s

clone_null_func

Passed

N/A

0.030000s

clone_null_stack

Passed

N/A

0.040000s

clone_out_of_proc

Passed

N/A

0.050000s

lib/libc/sys/t_connect

0.059640s

connect_low_port

Passed

N/A

0.050000s

lib/libc/sys/t_dup

0.580000s

dup2_basic

Passed

N/A

0.040000s

dup2_err

Passed

N/A

0.030352s

dup2_max

Passed

N/A

0.030000s

dup2_mode

Passed

N/A

0.070000s

dup3_err

Passed

N/A

0.040000s

dup3_max

Passed

N/A

0.040000s

dup3_mode

Passed

N/A

0.080000s

dup_err

Passed

N/A

0.040000s

dup_max

Passed

N/A

0.080000s

dup_mode

Passed

N/A

0.080000s

lib/libc/sys/t_fsync

0.130000s

fsync_err

Passed

N/A

0.050000s

fsync_sync

Passed

N/A

0.070000s

lib/libc/sys/t_getcontext

0.130000s

getcontext_err

Passed

N/A

0.030000s

setcontext_err

Passed

N/A

0.030000s

setcontext_link

Passed

N/A

0.030000s

lib/libc/sys/t_getgroups

0.240000s

getgroups_err

Passed

N/A

0.040000s

getgroups_getgid

Passed

N/A

0.040000s

getgroups_setgid

Passed

N/A

0.070000s

getgroups_zero

Passed

N/A

0.070000s

lib/libc/sys/t_getitimer

0.220000s

getitimer_empty

Passed

N/A

0.041159s

getitimer_err

Passed

N/A

0.030000s

setitimer_basic

Passed

N/A

0.051219s

setitimer_err

Passed

N/A

0.038369s

setitimer_old

Passed

N/A

0.033757s

lib/libc/sys/t_getlogin

0.218751s

getlogin_r_err

Passed

N/A

0.035089s

getlogin_same

Passed

N/A

0.031693s

setlogin_basic

Passed

N/A

0.041185s

setlogin_err

Passed

N/A

0.040000s

setlogin_perm

Passed

N/A

0.044755s

lib/libc/sys/t_getpid

0.141334s

getpid_process

Passed

N/A

0.089280s

getpid_thread

Passed

N/A

0.042060s

lib/libc/sys/t_getrusage

25.841064s

getrusage_err

Passed

N/A

0.032936s

getrusage_sig

Passed

N/A

0.030000s

getrusage_utime_back

Expected failure

PR kern/30115: anticipated error did not occur

17.162599s

getrusage_utime_zero

Expected failure

PR kern/30115: anticipated error did not occur

8.600000s

lib/libc/sys/t_getsid

0.130000s

getsid_current

Passed

N/A

0.030000s

getsid_err

Passed

N/A

0.040000s

getsid_process

Passed

N/A

0.040000s

lib/libc/sys/t_gettimeofday

0.080000s

gettimeofday_err

Passed

N/A

0.030000s

gettimeofday_mono

Passed

N/A

0.030000s

lib/libc/sys/t_issetugid

0.210000s

issetugid_egid

Passed

N/A

0.050000s

issetugid_euid

Passed

N/A

0.040000s

issetugid_rgid

Passed

N/A

0.040000s

issetugid_ruid

Passed

N/A

0.040000s

lib/libc/sys/t_kevent

0.100000s

kevent_zerotimer

Passed

N/A

0.040000s

kqueue_desc_passing

Skipped

PR kern/46523

0.040851s

lib/libc/sys/t_kill

1.250000s

kill_basic

Passed

N/A

0.040000s

kill_err

Passed

N/A

0.040000s

kill_perm

Passed

N/A

1.060000s

kill_pgrp_neg

Passed

N/A

0.040000s

kill_pgrp_zero

Passed

N/A

0.040000s

lib/libc/sys/t_link

0.260000s

link_count

Passed

N/A

0.070000s

link_err

Passed

N/A

0.070000s

link_perm

Passed

N/A

0.040000s

link_stat

Passed

N/A

0.068951s

lib/libc/sys/t_listen

0.204901s

listen_err

Passed

N/A

0.145533s

listen_low_port

Passed

N/A

0.040000s

lib/libc/sys/t_lwp_ctl

0.061099s

lwpctl_counter

Passed

N/A

0.050000s

lib/libc/sys/t_lwp_create

0.236318s

lwp_create_generic_fail_no_uc_cpu

Passed

N/A

0.036987s

lwp_create_sparc_fail_npc_null

Passed

N/A

0.035065s

lwp_create_sparc_fail_npc_odd

Passed

N/A

0.032990s

lwp_create_sparc_fail_pc_null

Passed

N/A

0.031160s

lwp_create_sparc_fail_pc_odd

Passed

N/A

0.031620s

lwp_create_works

Passed

N/A

0.033063s

lib/libc/sys/t_mincore

0.174271s

mincore_err

Passed

N/A

0.030477s

mincore_resid

Skipped

mlockall() exceeded process resource limits

0.073159s

mincore_shmseg

Passed

N/A

0.048537s

lib/libc/sys/t_mkdir

1.250000s

mkdir_err

Passed

N/A

0.040000s

mkdir_mode

Passed

N/A

1.080000s

mkdir_perm

Passed

N/A

0.072730s

mkdir_trail

Passed

N/A

0.042085s

lib/libc/sys/t_mkfifo

2.386846s

mkfifo_block

Passed

N/A

1.081181s

mkfifo_err

Passed

N/A

0.067243s

mkfifo_nonblock

Passed

N/A

1.070000s

mkfifo_perm

Passed

N/A

0.071016s

mkfifo_stat

Passed

N/A

0.070000s

lib/libc/sys/t_mknod

0.290000s

mknod_err

Passed

N/A

0.068870s

mknod_exist

Passed

N/A

0.070000s

mknod_perm

Passed

N/A

0.070000s

mknod_stat

Passed

N/A

0.068514s

lib/libc/sys/t_mlock

0.250000s

mlock_clip

Passed

N/A

0.040000s

mlock_err

Passed

N/A

0.040000s

mlock_limits

Passed

N/A

0.090000s

mlock_mmap

Passed

N/A

0.040000s

mlock_nested

Passed

N/A

0.040000s

lib/libc/sys/t_mmap

0.560000s

mmap_block

Skipped

The test case causes a panic (PR kern/38889, kern/46592)

0.037761s

mmap_err

Passed

N/A

0.039375s

mmap_loan

Passed

N/A

0.080000s

mmap_prot_1

Passed

N/A

0.143418s

mmap_prot_2

Passed

N/A

0.050000s

mmap_prot_3

Passed

N/A

0.070000s

mmap_truncate

Passed

N/A

0.060931s

mmap_va0

Passed

N/A

0.036878s

lib/libc/sys/t_mprotect

0.232579s

mprotect_access

Passed

N/A

0.069515s

mprotect_err

Passed

N/A

0.030000s

mprotect_exec

Skipped

Execute protection callback check not implemented

0.030000s

mprotect_pax

Passed

N/A

0.038806s

mprotect_write

Passed

N/A

0.040000s

lib/libc/sys/t_msgctl

2.401230s

msgctl_err

Passed

N/A

0.060000s

msgctl_perm

Passed

N/A

0.082717s

msgctl_pid

Passed

N/A

2.080000s

msgctl_set

Passed

N/A

0.070000s

msgctl_time

Passed

N/A

0.070000s

lib/libc/sys/t_msgget

0.370000s

msgget_excl

Passed

N/A

0.070000s

msgget_exit

Passed

N/A

0.079373s

msgget_init

Passed

N/A

0.060000s

msgget_limit

Passed

N/A

0.062508s

msgget_mode

Passed

N/A

0.070000s

lib/libc/sys/t_msgrcv

4.446472s

msgrcv_basic

Passed

N/A

0.070000s

msgrcv_block

Passed

N/A

2.080000s

msgrcv_err

Passed

N/A

0.065712s

msgrcv_mtype

Passed

N/A

0.065418s

msgrcv_nonblock

Passed

N/A

2.075152s

msgrcv_truncate

Passed

N/A

0.063568s

lib/libc/sys/t_msgsnd

4.380000s

msgsnd_block

Passed

N/A

2.077198s

msgsnd_count

Passed

N/A

0.069069s

msgsnd_err

Passed

N/A

0.069572s

msgsnd_nonblock

Passed

N/A

2.070000s

msgsnd_perm

Passed

N/A

0.070000s

lib/libc/sys/t_msync

0.550000s

msync_async

Passed

N/A

0.120000s

msync_err

Passed

N/A

0.180000s

msync_invalidate

Passed

N/A

0.110000s

msync_sync

Passed

N/A

0.120000s

lib/libc/sys/t_nanosleep

1.295882s

nanosleep_basic

Passed

N/A

0.210000s

nanosleep_err

Passed

N/A

0.040000s

nanosleep_sig

Passed

N/A

1.040000s

lib/libc/sys/t_pipe

2.104809s

pipe_restart

Passed

N/A

2.100974s

lib/libc/sys/t_pipe2

0.240831s

pipe2_basic

Passed

N/A

0.032654s

pipe2_cloexec

Passed

N/A

0.032777s

pipe2_consume

Passed

N/A

0.033718s

pipe2_einval

Passed

N/A

0.032759s

pipe2_nonblock

Passed

N/A

0.033810s

pipe2_nosigpipe

Passed

N/A

0.034749s

lib/libc/sys/t_posix_fadvise

0.364857s

posix_fadvise

Passed

N/A

0.050791s

posix_fadvise_reg

Passed

N/A

0.280000s

lib/libc/sys/t_poll

11.290000s

poll_3way

Passed

N/A

10.060000s

poll_basic

Passed

N/A

0.052515s

poll_err

Passed

N/A

0.040000s

pollts_basic

Passed

N/A

1.040000s

pollts_err

Passed

N/A

0.040000s

pollts_sigmask

Passed

N/A

0.040000s

lib/libc/sys/t_revoke

0.208181s

revoke_basic

Passed

N/A

0.060560s

revoke_err

Passed

N/A

0.040000s

revoke_perm

Passed

N/A

0.074337s

lib/libc/sys/t_select

1.110000s

pselect_sigmask

Passed

N/A

1.058203s

pselect_timeout

Passed

N/A

0.040000s

lib/libc/sys/t_setrlimit

0.489436s

setrlimit_basic

Passed

N/A

0.031631s

setrlimit_current

Passed

N/A

0.030152s

setrlimit_err

Passed

N/A

0.030338s

setrlimit_fsize

Passed

N/A

0.070000s

setrlimit_memlock

Passed

N/A

0.041865s

setrlimit_nofile_1

Passed

N/A

0.049014s

setrlimit_nofile_2

Passed

N/A

0.040000s

setrlimit_nproc

Passed

N/A

0.040000s

setrlimit_nthr

Passed

N/A

0.040000s

setrlimit_perm

Passed

N/A

0.040000s

lib/libc/sys/t_setuid

0.220000s

setuid_perm

Passed

N/A

0.040000s

setuid_real

Passed

N/A

0.040000s

setuid_root

Passed

N/A

0.140000s

lib/libc/sys/t_sigaction

0.180000s

sigaction_noflags

Passed

N/A

0.080000s

sigaction_resethand

Failed

Child process did not exit cleanly; it either failed to process the signal or SA_RESETHAND is broken; raw exit status was 139

0.070000s

lib/libc/sys/t_sigqueue

0.080000s

sigqueue_basic

Passed

N/A

0.040000s

sigqueue_err

Passed

N/A

0.040000s

lib/libc/sys/t_socketpair

0.120000s

socketpair_basic

Passed

N/A

0.040000s

socketpair_cloexec

Passed

N/A

0.040000s

socketpair_nonblock

Passed

N/A

0.040000s

lib/libc/sys/t_stat

4.499681s

stat_chflags

Passed

N/A

0.060000s

stat_dir

Passed

N/A

1.030000s

stat_err

Passed

N/A

0.040000s

stat_mtime

Passed

N/A

3.090000s

stat_perm

Passed

N/A

0.064776s

stat_size

Passed

N/A

0.068243s

stat_socket

Passed

N/A

0.040000s

stat_symlink

Passed

N/A

0.065064s

lib/libc/sys/t_timer_create

6.249843s

timer_create_err

Passed

N/A

0.038369s

timer_create_mono

Passed

N/A

1.058395s

timer_create_mono_expire

Passed

N/A

2.040000s

timer_create_real

Passed

N/A

1.050000s

timer_create_real_expire

Passed

N/A

2.040000s

lib/libc/sys/t_truncate

0.250000s

ftruncate_basic

Passed

N/A

0.080000s

ftruncate_err

Passed

N/A

0.040000s

truncate_basic

Passed

N/A

0.080000s

truncate_err

Passed

N/A

0.039540s

lib/libc/sys/t_ucontext

0.040000s

ucontext_basic

Passed

N/A

0.040000s

lib/libc/sys/t_umask

0.270000s

umask_fork

Passed

N/A

0.114710s

umask_open

Passed

N/A

0.070000s

umask_previous

Passed

N/A

0.060000s

lib/libc/sys/t_unlink

0.550000s

unlink_basic

Passed

N/A

0.327610s

unlink_err

Passed

N/A

0.069268s

unlink_fifo

Passed

N/A

0.070000s

unlink_perm

Passed

N/A

0.076215s

lib/libc/sys/t_write

0.318681s

write_err

Passed

N/A

0.068166s

write_pipe

Passed

N/A

0.033596s

write_pos

Passed

N/A

0.076665s

write_ret

Passed

N/A

0.078432s

writev_iovmax

Passed

N/A

0.040000s

lib/libc/termios/t_tcsetpgrp

0.070000s

tcsetpgrp_err

Passed

N/A

0.047068s

lib/libc/time/t_mktime

0.161292s

localtime_r_gmt

Passed

N/A

0.063873s

mktime_negyear

Passed

N/A

0.042071s

timegm_epoch

Passed

N/A

0.040000s

lib/libc/time/t_strptime

0.136955s

common

Passed

N/A

0.031260s

day

Passed

N/A

0.036062s

month

Passed

N/A

0.037262s

lib/libc/tls/t_tls_static

0.032090s

t_tls_static

Passed

N/A

0.023001s

lib/libc/tls/t_tls_dynamic

0.090000s

t_tls_dynamic

Passed

N/A

0.083645s

lib/libc/tls/t_tls_dlopen

0.180000s

t_tls_dlopen

Passed

N/A

0.160000s

lib/libc/ttyio/t_ptm

0.095098s

ptm

Passed

N/A

0.047770s

ptmx

Passed

N/A

0.040000s

lib/libc/ttyio/t_ttyio

2.070013s

ioctl

Passed

N/A

2.070000s

lib/libc/ssp/t_ssp

12.766262s

fgets

Passed

N/A

0.740000s

getcwd

Passed

N/A

0.690000s

gets

Passed

N/A

0.830000s

memcpy

Passed

N/A

0.770457s

memmove

Passed

N/A

0.690000s

memset

Passed

N/A

0.730000s

raw

Passed

N/A

0.703052s

read

Passed

N/A

0.780000s

readlink

Passed

N/A

0.690125s

snprintf

Passed

N/A

0.750000s

sprintf

Passed

N/A

0.766923s

strcat

Passed

N/A

0.700000s

strcpy

Passed

N/A

0.740000s

strncat

Passed

N/A

0.710891s

strncpy

Passed

N/A

0.750000s

vsnprintf

Passed

N/A

0.700000s

vsprintf

Passed

N/A

0.740000s

lib/libc/t_convfp

0.181959s

cast_ulong

Passed

N/A

0.040000s

cast_ulong2

Passed

N/A

0.038040s

conv_uint

Passed

N/A

0.030297s

conv_ulong

Passed

N/A

0.034110s

lib/libc/t_gdtoa

0.091398s

long_format

Passed

N/A

0.087685s

lib/libcrypt/t_crypt

0.054956s

crypt_salts

Passed

N/A

0.050980s

lib/libcurses/t_curses

24.803028s

addch

Passed

N/A

0.790000s

addchnstr

Passed

N/A

0.580000s

addchstr

Passed

N/A

0.640000s

addnstr

Passed

N/A

0.520000s

addstr

Passed

N/A

0.600000s

assume_default_colors

Passed

N/A

0.850000s

attributes

Passed

N/A

0.874840s

background

Passed

N/A

0.966810s

box

Passed

N/A

0.780000s

can_change_color

Passed

N/A

0.573586s

cbreak

Passed

N/A

0.850000s

clear

Passed

N/A

2.960000s

copywin

Passed

N/A

1.940540s

curs_set

Passed

N/A

0.720000s

getch

Passed

N/A

0.564509s

getstr

Passed

N/A

0.720000s

mvwin

Passed

N/A

0.810656s

startup

Passed

N/A

0.548306s

termattrs

Passed

N/A

0.570000s

timeout

Passed

N/A

4.900000s

wborder

Passed

N/A

0.730000s

window

Passed

N/A

0.610000s

wprintw

Passed

N/A

0.637781s

wscrl

Passed

N/A

0.748313s

lib/libevent/t_event

102.849070s

kqueue

Passed

N/A

34.330000s

poll

Passed

N/A

34.256434s

select

Passed

N/A

34.212473s

lib/libexecinfo/t_backtrace

0.059941s

backtrace_fmt_basic

Skipped

PR toolchain/46490: libexecinfo only works on amd64 currently

0.040000s

lib/libm/t_acos

0.660000s

acos_cos

Passed

N/A

0.070000s

acos_inf_neg

Passed

N/A

0.050000s

acos_inf_pos

Passed

N/A

0.040000s

acos_nan

Passed

N/A

0.040000s

acos_one_pos

Passed

N/A

0.040000s

acos_range

Passed

N/A

0.040000s

acosf_cosf

Passed

N/A

0.110000s

acosf_inf_neg

Passed

N/A

0.060000s

acosf_inf_pos

Passed

N/A

0.040000s

acosf_nan

Passed

N/A

0.040000s

acosf_one_pos

Passed

N/A

0.050000s

acosf_range

Passed

N/A

0.040000s

lib/libm/t_asin

0.625979s

asin_inf_neg

Passed

N/A

0.040000s

asin_inf_pos

Passed

N/A

0.050000s

asin_nan

Passed

N/A

0.040000s

asin_range

Passed

N/A

0.040000s

asin_sin

Passed

N/A

0.040000s

asin_zero_neg

Passed

N/A

0.040000s

asin_zero_pos

Passed

N/A

0.040000s

asinf_inf_neg

Passed

N/A

0.041597s

asinf_inf_pos

Passed

N/A

0.040000s

asinf_nan

Passed

N/A

0.040000s

asinf_range

Passed

N/A

0.040000s

asinf_sinf

Passed

N/A

0.040000s

asinf_zero_neg

Passed

N/A

0.030000s

asinf_zero_pos

Passed

N/A

0.034972s

lib/libm/t_atan

0.526420s

atan_inf_neg

Passed

N/A

0.042449s

atan_inf_pos

Passed

N/A

0.040000s

atan_nan

Passed

N/A

0.037529s

atan_tan

Passed

N/A

0.045678s

atan_zero_neg

Passed

N/A

0.038502s

atan_zero_pos

Passed

N/A

0.040000s

atanf_inf_neg

Passed

N/A

0.037411s

atanf_inf_pos

Passed

N/A

0.037387s

atanf_nan

Passed

N/A

0.040000s

atanf_tanf

Passed

N/A

0.040000s

atanf_zero_neg

Passed

N/A

0.037488s

atanf_zero_pos

Passed

N/A

0.039760s

lib/libm/t_cbrt

0.520000s

cbrt_inf_neg

Passed

N/A

0.040000s

cbrt_inf_pos

Passed

N/A

0.042881s

cbrt_nan

Passed

N/A

0.040000s

cbrt_pow

Passed

N/A

0.040335s

cbrt_zero_neg

Passed

N/A

0.038638s

cbrt_zero_pos

Passed

N/A

0.040000s

cbrtf_inf_neg

Passed

N/A

0.038507s

cbrtf_inf_pos

Passed

N/A

0.038360s

cbrtf_nan

Passed

N/A

0.040000s

cbrtf_powf

Passed

N/A

0.040000s

cbrtf_zero_neg

Passed

N/A

0.038105s

cbrtf_zero_pos

Passed

N/A

0.040000s

lib/libm/t_ceil

1.080000s

ceil_basic

Passed

N/A

0.041160s

ceil_inf_neg

Passed

N/A

0.040000s

ceil_inf_pos

Passed

N/A

0.041614s

ceil_nan

Passed

N/A

0.040000s

ceil_zero_neg

Passed

N/A

0.040000s

ceil_zero_pos

Passed

N/A

0.040000s

ceilf_basic

Passed

N/A

0.040301s

ceilf_inf_neg

Passed

N/A

0.040000s

ceilf_inf_pos

Passed

N/A

0.041458s

ceilf_nan

Passed

N/A

0.040000s

ceilf_zero_neg

Passed

N/A

0.045594s

ceilf_zero_pos

Passed

N/A

0.040000s

floor_basic

Passed

N/A

0.040431s

floor_inf_neg

Passed

N/A

0.040000s

floor_inf_pos

Passed

N/A

0.041671s

floor_nan

Passed

N/A

0.040000s

floor_zero_neg

Passed

N/A

0.043996s

floor_zero_pos

Passed

N/A

0.040000s

floorf_basic

Passed

N/A

0.040000s

floorf_inf_neg

Passed

N/A

0.041231s

floorf_inf_pos

Passed

N/A

0.040000s

floorf_nan

Passed

N/A

0.043415s

floorf_zero_neg

Passed

N/A

0.040000s

floorf_zero_pos

Passed

N/A

0.040607s

lib/libm/t_cos

0.539912s

cos_angles

Passed

N/A

0.040000s

cos_inf_neg

Passed

N/A

0.038517s

cos_inf_pos

Passed

N/A

0.040000s

cos_nan

Passed

N/A

0.040000s

cos_zero_neg

Passed

N/A

0.037995s

cos_zero_pos

Passed

N/A

0.040000s

cosf_angles

Passed

N/A

0.040000s

cosf_inf_neg

Passed

N/A

0.038427s

cosf_inf_pos

Passed

N/A

0.040000s

cosf_nan

Passed

N/A

0.040000s

cosf_zero_neg

Passed

N/A

0.040917s

cosf_zero_pos

Passed

N/A

0.035087s

lib/libm/t_cosh

0.640000s

cosh_def

Passed

N/A

0.123027s

cosh_inf_neg

Passed

N/A

0.039316s

cosh_inf_pos

Passed

N/A

0.039657s

cosh_nan

Passed

N/A

0.040000s

cosh_zero_neg

Passed

N/A

0.040502s

cosh_zero_pos

Passed

N/A

0.040000s

coshf_def

Passed

N/A

0.050000s

coshf_inf_neg

Passed

N/A

0.038418s

coshf_inf_pos

Passed

N/A

0.040000s

coshf_nan

Passed

N/A

0.040000s

coshf_zero_neg

Passed

N/A

0.033757s

coshf_zero_pos

Passed

N/A

0.035945s

lib/libm/t_erf

0.710111s

erf_inf_neg

Passed

N/A

0.040000s

erf_inf_pos

Passed

N/A

0.040000s

erf_nan

Passed

N/A

0.038760s

erf_zero_neg

Passed

N/A

0.040000s

erf_zero_pos

Passed

N/A

0.040000s

erfc_inf_neg

Passed

N/A

0.037964s

erfc_inf_pos

Passed

N/A

0.040000s

erfc_nan

Passed

N/A

0.040000s

erfcf_inf_neg

Passed

N/A

0.034346s

erfcf_inf_pos

Passed

N/A

0.040000s

erfcf_nan

Passed

N/A

0.040000s

erff_inf_neg

Passed

N/A

0.040000s

erff_inf_pos

Passed

N/A

0.040000s

erff_nan

Passed

N/A

0.040000s

erff_zero_neg

Passed

N/A

0.038573s

erff_zero_pos

Passed

N/A

0.039137s

lib/libm/t_exp

1.573186s

exp2_inf_neg

Passed

N/A

0.040000s

exp2_inf_pos

Passed

N/A

0.045127s

exp2_nan

Passed

N/A

0.040000s

exp2_product

Passed

N/A

0.046536s

exp2_zero_neg

Passed

N/A

0.040000s

exp2_zero_pos

Passed

N/A

0.046518s

exp2f_inf_neg

Passed

N/A

0.040000s

exp2f_inf_pos

Passed

N/A

0.040568s

exp2f_nan

Passed

N/A

0.040000s

exp2f_product

Passed

N/A

0.040000s

exp2f_zero_neg

Passed

N/A

0.040000s

exp2f_zero_pos

Passed

N/A

0.040000s

exp_inf_neg

Passed

N/A

0.040000s

exp_inf_pos

Passed

N/A

0.040000s

exp_nan

Passed

N/A

0.046946s

exp_product

Passed

N/A

0.040000s

exp_zero_neg

Passed

N/A

0.042686s

exp_zero_pos

Passed

N/A

0.040000s

expf_inf_neg

Passed

N/A

0.040000s

expf_inf_pos

Passed

N/A

0.040000s

expf_nan

Passed

N/A

0.040000s

expf_product

Passed

N/A

0.047942s

expf_zero_neg

Passed

N/A

0.040000s

expf_zero_pos

Passed

N/A

0.042285s

expm1_inf_neg

Passed

N/A

0.040000s

expm1_inf_pos

Passed

N/A

0.043169s

expm1_nan

Passed

N/A

0.040000s

expm1_zero_neg

Passed

N/A

0.040278s

expm1_zero_pos

Passed

N/A

0.047383s

expm1f_inf_neg

Passed

N/A

0.042962s

expm1f_inf_pos

Passed

N/A

0.040000s

expm1f_nan

Passed

N/A

0.042943s

expm1f_zero_neg

Passed

N/A

0.040000s

expm1f_zero_pos

Passed

N/A

0.047841s

lib/libm/t_infinity

0.330465s

infinity_double

Passed

N/A

0.040000s

infinity_float

Passed

N/A

0.040000s

infinity_long_double

Passed

N/A

0.230000s

lib/libm/t_ldexp

0.870000s

ldexp_basic

Passed

N/A

0.060000s

ldexp_denormal

Passed

N/A

0.047367s

ldexp_denormal_large

Passed

N/A

0.050000s

ldexp_exp2

Passed

N/A

0.040000s

ldexp_inf_neg

Passed

N/A

0.047092s

ldexp_inf_pos

Passed

N/A

0.040000s

ldexp_infinity

Passed

N/A

0.041485s

ldexp_nan

Passed

N/A

0.040000s

ldexp_overflow

Passed

N/A

0.040000s

ldexp_underflow

Passed

N/A

0.040000s

ldexp_zero

Passed

N/A

0.040000s

ldexp_zero_neg

Passed

N/A

0.040000s

ldexp_zero_pos

Passed

N/A

0.040000s

ldexpf_exp2f

Passed

N/A

0.040616s

ldexpf_inf_neg

Passed

N/A

0.040000s

ldexpf_inf_pos

Passed

N/A

0.040000s

ldexpf_nan

Passed

N/A

0.037323s

ldexpf_zero_neg

Passed

N/A

0.040000s

ldexpf_zero_pos

Passed

N/A

0.040000s

lib/libm/t_log

2.800000s

log10_base

Passed

N/A

0.040000s

log10_inf_neg

Passed

N/A

0.041874s

log10_inf_pos

Passed

N/A

0.050000s

log10_nan

Passed

N/A

0.050000s

log10_one_pos

Passed

N/A

0.050000s

log10_zero_neg

Passed

N/A

0.050000s

log10_zero_pos

Passed

N/A

0.050000s

log10f_base

Passed

N/A

0.050000s

log10f_inf_neg

Passed

N/A

0.050000s

log10f_inf_pos

Passed

N/A

0.050000s

log10f_nan

Passed

N/A

0.080000s

log10f_one_pos

Passed

N/A

0.050000s

log10f_zero_neg

Passed

N/A

0.049913s

log10f_zero_pos

Passed

N/A

0.040000s

log1p_inf_neg

Passed

N/A

0.040000s

log1p_inf_pos

Passed

N/A

0.040000s

log1p_nan

Passed

N/A

0.040000s

log1p_one_neg

Passed

N/A

0.040000s

log1p_zero_neg

Passed

N/A

0.040000s

log1p_zero_pos

Passed

N/A

0.040939s

log1pf_inf_neg

Passed

N/A

0.050000s

log1pf_inf_pos

Passed

N/A

0.050000s

log1pf_nan

Passed

N/A

0.050000s

log1pf_one_neg

Passed

N/A

0.040000s

log1pf_zero_neg

Passed

N/A

0.040000s

log1pf_zero_pos

Passed

N/A

0.040000s

log2_base

Passed

N/A

0.040000s

log2_inf_neg

Passed

N/A

0.040000s

log2_inf_pos

Passed

N/A

0.040000s

log2_nan

Passed

N/A

0.040601s

log2_one_pos

Passed

N/A

0.050000s

log2_zero_neg

Passed

N/A

0.090000s

log2_zero_pos

Passed

N/A

0.080000s

log2f_base

Passed

N/A

0.050000s

log2f_inf_neg

Passed

N/A

0.050000s

log2f_inf_pos

Passed

N/A

0.050000s

log2f_nan

Passed

N/A

0.040000s

log2f_one_pos

Passed

N/A

0.040000s

log2f_zero_neg

Passed

N/A

0.040000s

log2f_zero_pos

Passed

N/A

0.050000s

log_base

Passed

N/A

0.050000s

log_inf_neg

Passed

N/A

0.043320s

log_inf_pos

Passed

N/A

0.040000s

log_nan

Passed

N/A

0.047870s

log_one_pos

Passed

N/A

0.047045s

log_zero_neg

Passed

N/A

0.043096s

log_zero_pos

Passed

N/A

0.040000s

logf_base

Passed

N/A

0.043234s

logf_inf_neg

Passed

N/A

0.048539s

logf_inf_pos

Passed

N/A

0.045822s

logf_nan

Passed

N/A

0.041700s

logf_one_pos

Passed

N/A

0.040799s

logf_zero_neg

Passed

N/A

0.045621s

logf_zero_pos

Passed

N/A

0.047935s

lib/libm/t_pow

0.930000s

pow_inf_neg_x

Passed

N/A

0.041357s

pow_inf_neg_y

Passed

N/A

0.040000s

pow_inf_pos_x

Passed

N/A

0.040217s

pow_inf_pos_y

Passed

N/A

0.040000s

pow_nan_x

Passed

N/A

0.038545s

pow_nan_y

Passed

N/A

0.039716s

pow_one_neg_x

Expected failure

PR lib/45372: 2 checks failed as expected; see output for more details

0.050000s

pow_one_pos_x

Passed

N/A

0.040873s

pow_zero_x

Expected failure

PR port-amd64/45391: 3 checks failed as expected; see output for more details

0.041219s

pow_zero_y

Passed

N/A

0.040409s

powf_inf_neg_x

Passed

N/A

0.043893s

powf_inf_neg_y

Passed

N/A

0.040000s

powf_inf_pos_x

Passed

N/A

0.040331s

powf_inf_pos_y

Passed

N/A

0.040385s

powf_nan_x

Passed

N/A

0.040000s

powf_nan_y

Passed

N/A

0.040074s

powf_one_neg_x

Expected failure

PR lib/45372: 2 checks failed as expected; see output for more details

0.040000s

powf_one_pos_x

Passed

N/A

0.041772s

powf_zero_x

Expected failure

PR port-amd64/45391: 3 checks failed as expected; see output for more details

0.043900s

powf_zero_y

Passed

N/A

0.040097s

lib/libm/t_round

0.044008s

round_dir

Passed

N/A

0.040000s

lib/libm/t_scalbn

0.736765s

scalbn_inf_neg

Passed

N/A

0.040000s

scalbn_inf_pos

Passed

N/A

0.040000s

scalbn_ldexp

Passed

N/A

0.037884s

scalbn_nan

Passed

N/A

0.040000s

scalbn_zero_neg

Passed

N/A

0.040000s

scalbn_zero_pos

Passed

N/A

0.038252s

scalbnf_inf_neg

Passed

N/A

0.038701s

scalbnf_inf_pos

Passed

N/A

0.040000s

scalbnf_ldexpf

Passed

N/A

0.036445s

scalbnf_nan

Passed

N/A

0.040612s

scalbnf_zero_neg

Passed

N/A

0.040000s

scalbnf_zero_pos

Passed

N/A

0.038265s

scalbnl_inf_neg

Skipped

Requires long double support

0.040000s

scalbnl_inf_pos

Skipped

Requires long double support

0.040000s

scalbnl_nan

Skipped

Requires long double support

0.038356s

scalbnl_zero_neg

Skipped

Requires long double support

0.040000s

scalbnl_zero_pos

Skipped

Requires long double support

0.040000s

lib/libm/t_sin

0.536937s

sin_angles

Passed

N/A

0.039971s

sin_inf_neg

Passed

N/A

0.040000s

sin_inf_pos

Passed

N/A

0.040000s

sin_nan

Passed

N/A

0.042019s

sin_zero_neg

Passed

N/A

0.040000s

sin_zero_pos

Passed

N/A

0.034693s

sinf_angles

Passed

N/A

0.039144s

sinf_inf_neg

Passed

N/A

0.038584s

sinf_inf_pos

Passed

N/A

0.040000s

sinf_nan

Passed

N/A

0.040000s

sinf_zero_neg

Passed

N/A

0.035373s

sinf_zero_pos

Passed

N/A

0.036525s

lib/libm/t_sinh

0.540000s

sinh_def

Passed

N/A

0.054177s

sinh_inf_neg

Passed

N/A

0.040000s

sinh_inf_pos

Passed

N/A

0.040000s

sinh_nan

Passed

N/A

0.038618s

sinh_zero_neg

Passed

N/A

0.040000s

sinh_zero_pos

Passed

N/A

0.040000s

sinhf_def

Passed

N/A

0.054555s

sinhf_inf_neg

Passed

N/A

0.040000s

sinhf_inf_pos

Passed

N/A

0.040000s

sinhf_nan

Passed

N/A

0.038713s

sinhf_zero_neg

Passed

N/A

0.040000s

sinhf_zero_pos

Passed

N/A

0.040000s

lib/libm/t_sqrt

0.593167s

sqrt_inf_neg

Passed

N/A

0.090000s

sqrt_inf_pos

Passed

N/A

0.040000s

sqrt_nan

Passed

N/A

0.033715s

sqrt_pow

Passed

N/A

0.038771s

sqrt_zero_neg

Passed

N/A

0.040000s

sqrt_zero_pos

Passed

N/A

0.040000s

sqrtf_inf_neg

Passed

N/A

0.037659s

sqrtf_inf_pos

Passed

N/A

0.040000s

sqrtf_nan

Passed

N/A

0.040000s

sqrtf_powf

Passed

N/A

0.035242s

sqrtf_zero_neg

Passed

N/A

0.037480s

sqrtf_zero_pos

Passed

N/A

0.040000s

lib/libm/t_tan

0.510000s

tan_angles

Passed

N/A

0.040000s

tan_inf_neg

Passed

N/A

0.035368s

tan_inf_pos

Passed

N/A

0.037989s

tan_nan

Passed

N/A

0.040000s

tan_zero_neg

Passed

N/A

0.040000s

tan_zero_pos

Passed

N/A

0.033801s

tanf_angles

Passed

N/A

0.037906s

tanf_inf_neg

Passed

N/A

0.040000s

tanf_inf_pos

Passed

N/A

0.040000s

tanf_nan

Passed

N/A

0.040000s

tanf_zero_neg

Passed

N/A

0.036592s

tanf_zero_pos

Passed

N/A

0.040000s

lib/libm/t_tanh

0.420000s

tanh_inf_neg

Passed

N/A

0.040000s

tanh_inf_pos

Passed

N/A

0.040000s

tanh_nan

Passed

N/A

0.040000s

tanh_zero_neg

Passed

N/A

0.036929s

tanh_zero_pos

Passed

N/A

0.040000s

tanhf_inf_neg

Passed

N/A

0.040000s

tanhf_inf_pos

Passed

N/A

0.040000s

tanhf_nan

Passed

N/A

0.034092s

tanhf_zero_neg

Passed

N/A

0.037248s

tanhf_zero_pos

Passed

N/A

0.040000s

lib/libobjc/t_threads

0.060000s

thread_callback

Passed

N/A

0.056356s

lib/libppath/t_ppath

1.328633s

component_at

Passed

N/A

0.050000s

copydel_bool_success

Passed

N/A

0.050000s

copydel_object_twice_success

Passed

N/A

0.050000s

copyset_bool_success

Passed

N/A

0.050000s

copyset_object_twice_success

Passed

N/A

0.051665s

create_bool_eexist

Passed

N/A

0.050000s

create_bool_success

Passed

N/A

0.043033s

delete_bool_eftype

Passed

N/A

0.041682s

delete_bool_enoent

Passed

N/A

0.040641s

delete_bool_success

Passed

N/A

0.070000s

get_bool_eftype

Passed

N/A

0.089577s

get_bool_enoent

Passed

N/A

0.040000s

get_bool_success

Passed

N/A

0.040000s

get_idx_key

Passed

N/A

0.042242s

get_string_eftype

Passed

N/A

0.046850s

get_string_enoent

Passed

N/A

0.040000s

get_string_success

Passed

N/A

0.040000s

length

Passed

N/A

0.042854s

pop_until_empty

Passed

N/A

0.040000s

ppath_copy

Passed

N/A

0.034366s

push_until_full

Passed

N/A

0.040000s

replace

Passed

N/A

0.040000s

set_bool_eftype

Passed

N/A

0.050000s

set_bool_enoent

Passed

N/A

0.040000s

set_bool_success

Passed

N/A

0.040000s

lib/libprop/t_basic

0.100000s

prop_basic

Passed

N/A

0.050000s

prop_dictionary_equals

Passed

N/A

0.040000s

lib/libpthread/t_barrier

10.100000s

barrier

Passed

N/A

10.099169s

lib/libpthread/t_cond

10.620000s

bogus_timedwaits

Passed

N/A

0.050000s

broadcast

Passed

N/A

1.380000s

cond_timedwait_race

Expected failure

PR lib/44756: /tmp/bracket/build/2012.06.14.20.18.16-sparc/src/tests/lib/libpthread/t_cond.c:338: rv == ETIMEDOUT not met

1.624842s

destroy_after_cancel

Passed

N/A

0.043360s

signal_before_unlock

Passed

N/A

2.050000s

signal_before_unlock_static_init

Passed

N/A

2.053747s

signal_delay_wait

Passed

N/A

2.041644s

signal_wait_race

Passed

N/A

1.310000s

lib/libpthread/t_detach

0.050000s

pthread_detach

Passed

N/A

0.040000s

lib/libpthread/t_equal

0.050000s

pthread_equal

Passed

N/A

0.040000s

lib/libpthread/t_fork

5.060000s

fork

Passed

N/A

5.058876s

lib/libpthread/t_fpu

0.158577s

fpu

Passed

N/A

0.140000s

lib/libpthread/t_join

0.068066s

pthread_join

Passed

N/A

0.060000s

lib/libpthread/t_kill

0.268982s

simple

Passed

N/A

0.260000s

lib/libpthread/t_mutex

37.370000s

mutex1

Passed

N/A

4.060000s

mutex2

Passed

N/A

14.750000s

mutex3

Passed

N/A

14.472087s

mutex4

Passed

N/A

4.060000s

lib/libpthread/t_name

0.043560s

name

Passed

N/A

0.040000s

lib/libpthread/t_once

0.172390s

once1

Passed

N/A

0.040000s

once2

Passed

N/A

0.073681s

once3

Passed

N/A

0.044700s

lib/libpthread/t_preempt

1.060000s

preempt1

Passed

N/A

1.060000s

lib/libpthread/t_rwlock

1.069775s

rwlock1

Passed

N/A

1.060000s

lib/libpthread/t_sem

21.000000s

before_start_no_threads

Passed

N/A

10.070000s

before_start_one_thread

Passed

N/A

10.310000s

named

Passed

N/A

0.090000s

unnamed

Passed

N/A

0.520000s

lib/libpthread/t_sigmask

4.210000s

before_threads

Passed

N/A

0.040000s

incorrect_mask_bug

Passed

N/A

3.060000s

respected_while_running

Passed

N/A

1.045942s

upcalls_not_started

Passed

N/A

0.042675s

lib/libpthread/t_sigsuspend

1.055281s

sigsuspend

Passed

N/A

1.044942s

lib/libpthread/t_siglongjmp

0.045446s

siglongjmp1

Passed

N/A

0.040000s

lib/libpthread/t_sleep

1.047381s

sleep1

Passed

N/A

1.040000s

lib/libpthread/t_atexit

0.609921s

atexit

Passed

N/A

0.580000s

lib/libpthread/t_cancel

0.550000s

register_while_disabled

Passed

N/A

0.540000s

lib/libpthread/t_exit

0.540000s

main_thread

Passed

N/A

0.490000s

lib/libpthread/t_resolv

21.590000s

resolv

Passed

N/A

21.567301s

lib/librt/t_sched

0.360000s

sched_getparam

Passed

N/A

0.048705s

sched_priority

Passed

N/A

0.040000s

sched_rr_get_interval_1

Passed

N/A

0.040823s

sched_rr_get_interval_2

Passed

N/A

0.040000s

sched_setscheduler_1

Passed

N/A

0.039793s

sched_setscheduler_2

Passed

N/A

0.040000s

sched_setscheduler_3

Passed

N/A

0.040000s

sched_setscheduler_4

Passed

N/A

0.039968s

lib/librt/t_sem

20.290000s

basic

Passed

N/A

0.040000s

child

Passed

N/A

20.239677s

lib/librumpclient/t_exec

17.127844s

cloexec

Passed

N/A

2.400193s

exec

Passed

N/A

2.110000s

noexec

Passed

N/A

2.070000s

threxec

Passed

N/A

8.010000s

vfork

Passed

N/A

2.399070s

lib/librumpclient/t_fd

1.216818s

bigenough

Passed

N/A

0.545517s

sigio

Passed

N/A

0.630000s

lib/librumphijack/t_asyncio

4.510000s

invafd

Passed

N/A

1.670000s

select_allunset

Passed

N/A

1.380000s

select_timeout

Passed

N/A

1.401748s

lib/librumphijack/t_config

1.585793s

fdoff

Passed

N/A

1.558250s

lib/librumphijack/t_cwd

11.830000s

basic_chdir

Passed

N/A

1.525063s

basic_fchdir

Passed

N/A

1.470000s

slash_chdir

Passed

N/A

1.511028s

slash_fchdir

Passed

N/A

1.480000s

symlink_chdir

Passed

N/A

1.465545s

symlink_fchdir

Passed

N/A

1.446286s

symlink_slash_chdir

Passed

N/A

1.370000s

symlink_slash_fchdir

Passed

N/A

1.400000s

lib/librumphijack/t_sh

4.360000s

redirect

Passed

N/A

2.370000s

runscript

Passed

N/A

1.933027s

lib/librumphijack/t_tcpip

25.767259s

http

Passed

N/A

3.092032s

nfs

Passed

N/A

10.530972s

nfs_autoload

Skipped

test currently valid only on i386

0.970000s

ssh

Passed

N/A

10.980000s

lib/librumphijack/t_vfs

21.330000s

blanket

Passed

N/A

2.040000s

cpcopy

Passed

N/A

4.190000s

doubleblanket

Passed

N/A

2.424509s

mv_nox

Passed

N/A

3.470444s

mv_x

Passed

N/A

2.607614s

paxcopy

Passed

N/A

4.670000s

runonprefix

Passed

N/A

1.690000s

lib/libtre/t_exhaust

0.040000s

regcomp_too_big

Skipped

Not enough memory; needed 125829120, available 32604160

0.008861s

lib/libtre/t_regex_att

4.130000s

basic

Passed

N/A

0.710903s

categorization

Passed

N/A

0.640000s

forcedassoc

Passed

N/A

0.624720s

leftassoc

Passed

N/A

0.639563s

nullsubexpr

Passed

N/A

0.670000s

repetition

Passed

N/A

0.740000s

lib/libutil/t_efun

0.200000s

ecalloc

Passed

N/A

0.050000s

efopen

Passed

N/A

0.040000s

emalloc

Passed

N/A

0.040000s

erealloc

Passed

N/A

0.046338s

lib/libutil/t_parsedate

0.306131s

dates

Passed

N/A

0.113356s

relative

Passed

N/A

0.090000s

times

Passed

N/A

0.041128s

lib/libutil/t_pidfile

0.410000s

change_basenames

Passed

N/A

0.080000s

change_mix

Passed

N/A

0.070000s

change_paths

Passed

N/A

0.060000s

custom_basename

Passed

N/A

0.050000s

custom_path

Passed

N/A

0.050000s

default_path

Passed

N/A

0.050000s

lib/libutil/t_snprintb

0.040000s

snprintb

Passed

N/A

0.040000s

lib/libutil/t_sockaddr_snprintf

0.210000s

sockaddr_snprintf_at

Passed

N/A

0.031678s

sockaddr_snprintf_dl

Passed

N/A

0.036165s

sockaddr_snprintf_in

Passed

N/A

0.039547s

sockaddr_snprintf_in6

Passed

N/A

0.040000s

sockaddr_snprintf_un

Passed

N/A

0.040000s

lib/semaphore/pthread/t_sem_pth

1.450000s

blocktimedwait

Passed

N/A

0.272959s

blockwait

Passed

N/A

0.390000s

busydestroy

Passed

N/A

0.140000s

destroy

Passed

N/A

0.120000s

initvalue

Passed

N/A

0.120000s

named

Passed

N/A

0.120000s

postwait

Passed

N/A

0.120000s

unlink

Passed

N/A

0.120000s

lib/libdes/t_des

0.670000s

align

Passed

N/A

0.060000s

cbc

Passed

N/A

0.040000s

cbc_cksum

Passed

N/A

0.040000s

cbcm

Passed

N/A

0.048908s

cfb

Passed

N/A

0.040000s

desx_cbc

Passed

N/A

0.040000s

ecb

Passed

N/A

0.040000s

ede_cbc

Passed

N/A

0.040000s

ede_ecb

Passed

N/A

0.040000s

ede_ofb64

Passed

N/A

0.030000s

fast_crypt

Passed

N/A

0.040000s

ofb

Passed

N/A

0.040000s

ofb64

Passed

N/A

0.040000s

pcbc

Passed

N/A

0.040000s

quad_cksum

Passed

N/A

0.030932s

lib/libskey/t_algorithms

0.820000s

md4

Passed

N/A

0.040000s

md5

Passed

N/A

0.040000s

sha1

Passed

N/A

0.710000s

libexec/ld.elf_so/t_dlerror-cleared

0.050000s

rtld_dlerror_cleared

Passed

N/A

0.050000s

libexec/ld.elf_so/t_dlerror-false

0.069595s

rtld_dlerror_false

Passed

N/A

0.030000s

libexec/ld.elf_so/t_dlinfo

0.160000s

rtld_dlinfo_linkmap_dlopen

Passed

N/A

0.040000s

rtld_dlinfo_linkmap_dlopen_iter

Passed

N/A

0.034682s

rtld_dlinfo_linkmap_inval

Passed

N/A

0.040000s

rtld_dlinfo_linkmap_self

Passed

N/A

0.040000s

libexec/ld.elf_so/t_dlvsym

0.220000s

rtld_dlvsym_symbol_nonexistent

Passed

N/A

0.040000s

rtld_dlvsym_v1

Passed

N/A

0.040000s

rtld_dlvsym_v3

Passed

N/A

0.040000s

rtld_dlvsym_version_nonexistent

Passed

N/A

0.034191s

rtld_dlvsym_version_null

Passed

N/A

0.035351s

libexec/ld.elf_so/t_df_1_noopen

1.152708s

df_1_noopen1

Passed

N/A

0.509179s

df_1_noopen2

Passed

N/A

0.596537s

libexec/ld.elf_so/t_dl_symver

1.996804s

dl_symver

Passed

N/A

1.980000s

modules/t_modctl

0.790000s

cmd_load

Failed

Module load failed

0.200000s

cmd_load_props

Failed

Module load failed

0.138118s

cmd_load_recurse

Failed

Module load failed

0.130000s

cmd_stat

Failed

Module load failed

0.134414s

cmd_unload

Failed

Module load failed

0.130000s

modules/t_builtin

1.210000s

busydisable

Passed

N/A

0.270000s

disable

Passed

N/A

0.236523s

disabledstat

Passed

N/A

0.230000s

forcereload

Passed

N/A

0.238247s

noauto

Passed

N/A

0.230000s

modules/t_abi_uvm

0.890000s

PAGE_SIZE

Skipped

host does not support modules

0.870000s

modules/t_modload

4.550000s

bflag

Passed

N/A

2.020000s

iflag

Skipped

host does not support modules

0.878752s

plain

Skipped

host does not support modules

0.810000s

sflag

Skipped

host does not support modules

0.810000s

net/bpf/t_bpf

0.610000s

bpfwriteleak

Passed

N/A

0.590000s

net/bpf/t_div-by-zero

0.540000s

div_by_zero

Passed

N/A

0.510000s

net/carp/t_basic

8.793279s

handover

Passed

N/A

8.770000s

net/icmp/t_forward

1.743321s

returndatabytes

Passed

N/A

1.710000s

net/icmp/t_ping

76.870000s

floodping

Passed

N/A

18.680000s

floodping2

Passed

N/A

29.130000s

ping_of_death

Passed

N/A

1.148937s

pingsize

Passed

N/A

26.560000s

simpleping

Passed

N/A

1.282936s

net/icmp/t_ping2

3.550760s

basic

Passed

N/A

3.517732s

net/if/t_compat

0.503333s

OOSIOCGIFBRDADDR

Passed

N/A

0.470525s

net/if_loop/t_pr

0.720000s

loopmtu

Passed

N/A

0.380000s

loopmtu_csum

Passed

N/A

0.320253s

net/net/t_raw

0.500000s

PRU_SENSE

Passed

N/A

0.475287s

net/net/t_unix

1.100000s

sockaddr_un_len_exceed

Passed

N/A

0.043926s

sockaddr_un_len_max

Passed

N/A

1.050000s

net/route/t_change

2.320000s

reject2blackhole

Passed

N/A

2.250000s

net/sys/t_rfc6056

0.160000s

inet4

Passed

N/A

0.090000s

inet6

Passed

N/A

0.070000s

rump/rumpkern/t_copy

0.681057s

copyinstr

Passed

N/A

0.250000s

copyoutstr

Passed

N/A

0.210000s

copystr

Passed

N/A

0.210000s

rump/rumpkern/t_kern

2.150000s

lockme_DESTROYHELD

Passed

N/A

0.400000s

lockme_DOUBLEFREE

Passed

N/A

0.410000s

lockme_DOUBLEINIT

Skipped

test requires LOCKDEBUG kernel

0.050000s

lockme_MEMFREE

Skipped

test requires LOCKDEBUG kernel

0.050000s

lockme_MTX

Passed

N/A

0.360000s

lockme_RWDOUBLEX

Passed

N/A

0.390000s

lockme_RWRX

Skipped

test requires LOCKDEBUG kernel

0.056967s

lockme_RWXR

Passed

N/A

0.350000s

rump/rumpkern/t_lwproc

1.950000s

inherit

Passed

N/A

0.220000s

lwps

Passed

N/A

0.259670s

makelwp

Passed

N/A

0.215588s

nolwp

Passed

N/A

0.210000s

nolwprelease

Passed

N/A

0.353118s

nullswitch

Passed

N/A

0.216890s

proccreds

Passed

N/A

0.217850s

rfork

Passed

N/A

0.223609s

rump/rumpkern/t_modcmd

0.550000s

cmsg_modcmd

Passed

N/A

0.533701s

rump/rumpkern/t_modlinkset

0.280000s

modlinkset

Passed

N/A

0.272368s

rump/rumpkern/t_signals

0.822236s

sigignore

Passed

N/A

0.216530s

sigpanic

Passed

N/A

0.366556s

sigraise

Passed

N/A

0.210429s

rump/rumpkern/t_threads

0.472838s

kthread

Passed

N/A

0.230000s

threadjoin

Passed

N/A

0.234907s

rump/rumpkern/t_tsleep

0.810000s

tsleep

Passed

N/A

0.800000s

rump/rumpkern/t_vm

11.420000s

busypage

Passed

N/A

0.290000s

uvmwait

Passed

N/A

11.081015s

rump/rumpkern/t_sp

77.003748s

basic

Passed

N/A

1.275420s

fork_fakeauth

Passed

N/A

1.414659s

fork_pipecomm

Passed

N/A

1.458924s

fork_simple

Passed

N/A

1.373234s

reconnect

Passed

N/A

3.350000s

signal

Passed

N/A

1.355154s

sigsafe

Passed

N/A

7.398353s

stress_killer

Passed

N/A

28.930651s

stress_long

Passed

N/A

21.450000s

stress_short

Passed

N/A

8.790000s

rump/rumpnet/t_shmif

66.170000s

crossping

Passed

N/A

66.100000s

rump/rumpvfs/t_basic

0.401239s

lseekrv

Passed

N/A

0.380000s

rump/rumpvfs/t_etfs

2.383323s

key

Passed

N/A

0.230000s

large_blk

Passed

N/A

0.817648s

range_blk

Passed

N/A

0.610000s

reregister_blk

Passed

N/A

0.449151s

reregister_reg

Passed

N/A

0.220000s

rump/rumpvfs/t_p2kifs

0.330000s

makecn

Passed

N/A

0.284095s

rump/modautoload/t_modautoload

0.060000s

modautoload

Skipped

host kernel modules not supported on this architecture

0.040000s

sbin/fsck_ffs/t_enable_quotas

32.580000s

corrupt_be_1

Passed

N/A

1.940000s

corrupt_be_2

Passed

N/A

1.699367s

corrupt_le_1

Passed

N/A

1.741418s

corrupt_le_2

Passed

N/A

1.700000s

dir1_be_1

Passed

N/A

1.550000s

dir1_be_2

Passed

N/A

1.540000s

dir1_le_1

Passed

N/A

1.600000s

dir1_le_2

Passed

N/A

1.549866s

disable_be_1

Passed

N/A

1.590000s

disable_be_2

Passed

N/A

1.550000s

disable_le_1

Passed

N/A

1.570000s

disable_le_2

Passed

N/A

1.570000s

notreg_be_1

Passed

N/A

1.700000s

notreg_be_2

Passed

N/A

1.677825s

notreg_le_1

Passed

N/A

1.723377s

notreg_le_2

Passed

N/A

1.710000s

unallocated_be_1

Passed

N/A

1.430430s

unallocated_be_2

Passed

N/A

1.429558s

unallocated_le_1

Passed

N/A

1.451174s

unallocated_le_2

Passed

N/A

1.460000s

sbin/fsck_ffs/t_check_quotas

93.553149s

corrupt_list_be_1

Passed

N/A

1.652130s

corrupt_list_be_2

Passed

N/A

1.656017s

corrupt_list_le_1

Passed

N/A

1.729089s

corrupt_list_le_2

Passed

N/A

1.640000s

expand1_list_be_1

Passed

N/A

2.057742s

expand1_list_be_2

Passed

N/A

2.000000s

expand1_list_le_1

Passed

N/A

1.980000s

expand1_list_le_2

Passed

N/A

2.046115s

expand2_list_be_1

Passed

N/A

18.530893s

expand2_list_be_2

Passed

N/A

18.873084s

expand2_list_le_1

Passed

N/A

18.723655s

expand2_list_le_2

Passed

N/A

18.670000s

sbin/ifconfig/t_nonexistent

0.545656s

nonexistent

Passed

N/A

0.516616s

sbin/newfs/t_enable_quotas

10.429746s

enabled_be_1_both

Passed

N/A

0.912091s

enabled_be_1_group

Passed

N/A

0.860000s

enabled_be_1_user

Passed

N/A

0.846886s

enabled_be_2_both

Passed

N/A

0.850561s

enabled_be_2_group

Passed

N/A

0.831777s

enabled_be_2_user

Passed

N/A

0.814667s

enabled_le_1_both

Passed

N/A

0.856634s

enabled_le_1_group

Passed

N/A

0.851853s

enabled_le_1_user

Passed

N/A

0.890000s

enabled_le_2_both

Passed

N/A

0.820000s

enabled_le_2_group

Passed

N/A

0.830000s

enabled_le_2_user

Passed

N/A

0.819117s

sbin/resize_ffs/t_grow

205.977396s

grow_16M_v0_8192

Passed

N/A

67.250000s

grow_16M_v1_16384

Passed

N/A

81.888316s

grow_16M_v2_32768

Passed

N/A

55.212115s

grow_ffsv1_partial_cg

Passed

N/A

1.203091s

sbin/resize_ffs/t_shrink

244.923007s

shrink_24M_16M_v0_32768

Passed

N/A

96.620000s

shrink_24M_16M_v1_65536

Passed

N/A

79.090000s

shrink_24M_16M_v2_4096

Expected failure

PR bin/44205: atf-check failed; see the output of the test for details

67.780000s

shrink_ffsv1_partial_cg

Passed

N/A

1.130000s

sbin/resize_ffs/t_grow_swapped

190.320000s

grow_16M_v0_65536

Passed

N/A

58.890000s

grow_16M_v1_4096

Passed

N/A

62.040000s

grow_16M_v2_8192

Passed

N/A

67.970000s

grow_ffsv1_partial_cg

Passed

N/A

1.090538s

sbin/resize_ffs/t_shrink_swapped

273.407234s

shrink_24M_16M_v0_4096

Passed

N/A

109.530000s

shrink_24M_16M_v1_8192

Passed

N/A

92.380000s

shrink_24M_16M_v2_16384

Expected failure

PR bin/44205: atf-check failed; see the output of the test for details

69.900370s

shrink_ffsv1_partial_cg

Passed

N/A

1.240000s

sbin/route/t_missing

0.550840s

missing

Passed

N/A

0.510000s

sbin/sysctl/t_perm

65.138856s

sysctl_ddb

Passed

N/A

2.485171s

sysctl_hw

Passed

N/A

3.100000s

sysctl_kern

Passed

N/A

18.230000s

sysctl_machdep

Passed

N/A

1.557364s

sysctl_net

Passed

N/A

28.058899s

sysctl_security

Passed

N/A

2.387443s

sysctl_vfs

Passed

N/A

5.907423s

sysctl_vm

Passed

N/A

3.270000s

sbin/sysctl/t_sysctl

0.714341s

basic

Passed

N/A

0.690000s

sys/rc/t_rc_d_cli

14.773895s

default_restart_no_args

Passed

N/A

1.637540s

default_restart_with_args

Passed

N/A

1.330000s

default_start_no_args

Passed

N/A

0.960000s

default_start_with_args

Passed

N/A

1.060000s

default_stop_no_args

Passed

N/A

0.950000s

default_stop_with_args

Passed

N/A

1.450000s

no_command

Passed

N/A

0.655282s

overriden_custom_no_args

Passed

N/A

0.790000s

overriden_custom_with_args

Passed

N/A

0.790000s

overriden_restart_no_args

Passed

N/A

0.850000s

overriden_restart_with_args

Passed

N/A

0.820866s

overriden_start_no_args

Passed

N/A

0.780000s

overriden_start_with_args

Passed

N/A

0.790000s

overriden_stop_no_args

Passed

N/A

0.803755s

overriden_stop_with_args

Passed

N/A

0.831299s

usr.bin/awk/t_awk

17.020000s

assign_NF

Passed

N/A

0.823232s

big_regexp

Passed

N/A

0.760000s

empty_rs

Passed

N/A

0.660000s

end

Passed

N/A

1.090000s

multibyte

Passed

N/A

1.260000s

newline_rs

Passed

N/A

0.640794s

period

Passed

N/A

0.792405s

regex_caret_1_rs

Passed

N/A

0.652787s

regex_caret_2_rs

Passed

N/A

0.650000s

regex_dollar_1_rs

Passed

N/A

0.624110s

regex_dollar_2_rs

Passed

N/A

0.620936s

regex_or_1_rs

Passed

N/A

0.629069s

regex_or_2_rs

Passed

N/A

0.650000s

regex_or_3_rs

Passed

N/A

0.638008s

regex_reallocation_rs

Passed

N/A

0.929703s

regex_two_star_rs

Passed

N/A

0.670000s

single_char_regex_group_rs

Passed

N/A

0.660000s

single_char_regex_star_rs

Passed

N/A

0.630000s

single_char_rs

Passed

N/A

0.660000s

string1

Passed

N/A

0.680000s

two_char_regex_group_rs

Passed

N/A

0.655025s

two_char_regex_star_rs

Passed

N/A

0.633253s

two_char_rs

Passed

N/A

0.650000s

usr.bin/basename/t_basename

2.049238s

basic

Passed

N/A

1.190000s

suffix

Passed

N/A

0.820000s

usr.bin/bzip2/t_bzip2

3.873434s

basic

Passed

N/A

3.840000s

usr.bin/cc/t_hello

6.470000s

hello

Passed

N/A

2.890000s

hello32

Skipped

this is not a 64 bit architecture

0.716098s

hello_pic

Passed

N/A

2.783114s

usr.bin/cmp/t_cmp

1.660000s

missing

Passed

N/A

0.950000s

skip

Passed

N/A

0.680000s

usr.bin/config/t_config

5.030000s

deffs_redef

Passed

N/A

0.652247s

loop

Passed

N/A

0.720000s

loop2

Passed

N/A

0.692992s

no_pseudo

Passed

N/A

0.680000s

postponed_orphan

Passed

N/A

0.680000s

pseudo_parent

Passed

N/A

0.713879s

shadow_instance

Passed

N/A

0.711855s

usr.bin/cut/t_cut

4.630000s

basic

Passed

N/A

0.760000s

dflag

Passed

N/A

0.850000s

dsflag

Passed

N/A

0.700000s

latin1

Passed

N/A

0.640000s

sflag

Passed

N/A

0.842197s

utf8

Passed

N/A

0.720000s

usr.bin/diff/t_diff

1.850000s

mallocv

Passed

N/A

0.600000s

nomallocv

Passed

N/A

0.590000s

same

Passed

N/A

0.597289s

usr.bin/dirname/t_dirname

1.290000s

basic

Passed

N/A

1.260000s

usr.bin/find/t_find

2.046592s

emptyperm

Passed

N/A

0.770216s

exit

Passed

N/A

0.600165s

exit_status

Passed

N/A

0.620000s

usr.bin/grep/t_grep

11.258237s

basic

Passed

N/A

0.890000s

begin_end

Passed

N/A

0.739262s

binary

Passed

N/A

0.590000s

context

Passed

N/A

0.911909s

context2

Passed

N/A

0.822691s

egrep

Passed

N/A

0.620000s

file_exp

Passed

N/A

0.680000s

ignore_case

Passed

N/A

0.630000s

invert

Passed

N/A

0.620000s

negative

Passed

N/A

0.586740s

nonexistent

Passed

N/A

0.536224s

recurse

Passed

N/A

0.586578s

recurse_symlink

Passed

N/A

0.680000s

whole_line

Passed

N/A

0.631202s

word_regexps

Passed

N/A

0.640000s

zgrep

Passed

N/A

0.760103s

usr.bin/gzip/t_gzip

23.340000s

concatenated

Passed

N/A

0.610000s

crcerror

Passed

N/A

0.608490s

good

Passed

N/A

0.600000s

pipe

Passed

N/A

20.826232s

truncated

Passed

N/A

0.615178s

usr.bin/id/t_groups

1.932273s

correct

Passed

N/A

1.130000s

syntax

Passed

N/A

0.751107s

usr.bin/id/t_id

16.116796s

Gflag

Passed

N/A

2.034203s

default

Passed

N/A

1.660000s

gflag

Passed

N/A

3.670000s

pflag

Passed

N/A

1.730106s

primaries

Passed

N/A

3.160000s

uflag

Passed

N/A

3.719748s

usr.bin/id/t_whoami

1.560000s

correct

Passed

N/A

0.787589s

syntax

Passed

N/A

0.723710s

usr.bin/infocmp/t_terminfo

2.450000s

basic

Passed

N/A

1.670000s

missing

Passed

N/A

0.733111s

usr.bin/jot/t_jot

1.380000s

basic

Passed

N/A

0.540000s

format

Passed

N/A

0.810000s

usr.bin/m4/t_m4

1.030000s

eof

Passed

N/A

1.006555s

usr.bin/make/t_make

30.280000s

comment

Passed

N/A

0.843603s

cond1

Passed

N/A

0.793471s

dotwait

Passed

N/A

12.930000s

export

Passed

N/A

0.877350s

export_all

Passed

N/A

0.862185s

moderrs

Passed

N/A

0.946256s

modmatch

Passed

N/A

1.354694s

modmisc

Passed

N/A

0.900000s

modorder

Passed

N/A

0.990000s

modts

Passed

N/A

1.200000s

modword

Passed

N/A

3.471138s

posix

Passed

N/A

1.031008s

qequals

Passed

N/A

0.718414s

ternary

Passed

N/A

1.053769s

unmatchedvarparen

Passed

N/A

0.720000s

varcmd

Passed

N/A

1.285544s

usr.bin/mkdep/t_mkdep

2.052024s

suffixes

Passed

N/A

2.020000s

usr.bin/pr/t_basic

0.630000s

basic

Passed

N/A

0.610000s

usr.bin/rump_server/t_disk

12.286605s

data

Passed

N/A

1.991264s

notrunc

Passed

N/A

1.410000s

offset

Passed

N/A

1.490000s

size

Passed

N/A

1.330000s

type_blk

Passed

N/A

1.460000s

type_blk_default

Passed

N/A

1.509758s

type_chr

Passed

N/A

1.548427s

type_reg

Passed

N/A

1.386371s

usr.bin/shmif_dumpbus/t_basic

4.850000s

contents

Passed

N/A

1.550000s

header

Passed

N/A

1.003914s

pcap

Passed

N/A

2.180000s

usr.bin/sdiff/t_sdiff

13.456356s

dot

Passed

N/A

0.727433s

flags

Passed

N/A

0.980000s

iflags

Passed

N/A

2.005938s

merge

Passed

N/A

4.870000s

oneline

Passed

N/A

0.820000s

same

Passed

N/A

0.636635s

short

Passed

N/A

0.705258s

stdin

Passed

N/A

0.950000s

tabends

Passed

N/A

0.936111s

tabs

Passed

N/A

0.660000s

usr.bin/sed/t_sed

4.570000s

c2048

Passed

N/A

0.551539s

emptybackref

Expected failure

PR bin/28126: atf-check failed; see the output of the test for details

0.810382s

longlines

Passed

N/A

0.922813s

rangeselection

Passed

N/A

2.188817s

usr.bin/sort/t_sort

36.540000s

any_char

Passed

N/A

0.980000s

basic

Passed

N/A

0.680000s

bflag

Passed

N/A

0.906387s

cflag

Passed

N/A

0.616468s

empty_file

Passed

N/A

0.754497s

end_of_options

Passed

N/A

0.740000s

kflag_alpha

Passed

N/A

1.960516s

kflag_limits

Passed

N/A

0.730000s

kflag_many_fields

Passed

N/A

0.649188s

kflag_no_end

Passed

N/A

0.650000s

kflag_nonmonotone

Passed

N/A

0.610000s

kflag_one_field

Passed

N/A

0.640000s

kflag_outofbounds

Passed

N/A

0.602449s

kflag_two_fields

Passed

N/A

0.636114s

long_file

Passed

N/A

2.789517s

long_records

Passed

N/A

0.800000s

mflag

Passed

N/A

0.660000s

mflag_uflag

Passed

N/A

0.610000s

mflag_uflag_first

Passed

N/A

0.720500s

missing_newline

Passed

N/A

0.600000s

nflag

Passed

N/A

0.640000s

nflag_rflag

Passed

N/A

0.640000s

null_bytes

Passed

N/A

0.620000s

oflag

Passed

N/A

0.751354s

oflag_displaced

Passed

N/A

0.530000s

plus_as_path

Passed

N/A

0.567470s

plus_bad_tempfile

Passed

N/A

0.842369s

plus_no_end

Passed

N/A

0.634096s

plus_nonmonotone

Passed

N/A

0.650000s

plus_one

Passed

N/A

0.640000s

plus_one_minus_two

Passed

N/A

0.640000s

plus_rflag_invalid

Passed

N/A

0.641518s

plus_tflag

Passed

N/A

3.030000s

plus_zero

Passed

N/A

0.590000s

rflag

Passed

N/A

0.660000s

sflag

Passed

N/A

0.650000s

sflag_many_files

Passed

N/A

0.672760s

tflag

Passed

N/A

0.910123s

tflag_alphabetic

Passed

N/A

0.624557s

tflag_char_pos

Passed

N/A

0.951909s

tflag_whitespace

Passed

N/A

1.172121s

uflag

Passed

N/A

0.642412s

uflag_rflag

Passed

N/A

0.640000s

usr.bin/tmux/t_tmux

2.550000s

stdin

Passed

N/A

2.540000s

usr.bin/unifdef/t_basic

0.679490s

basic

Passed

N/A

0.650348s

usr.bin/xlint/lint1/t_integration

24.800000s

alignof

Passed

N/A

0.745321s

c99_complex_num

Passed

N/A

0.680627s

c99_decls_after_stmt

Passed

N/A

0.678544s

c99_for_loops

Passed

N/A

0.650000s

c99_func

Passed

N/A

0.644134s

c99_recursive_init

Passed

N/A

0.651072s

c99_struct_init

Passed

N/A

0.663954s

c99_union_init1

Passed

N/A

0.710013s

c99_union_init2

Passed

N/A

0.670000s

c99_union_init3

Passed

N/A

0.670000s

c9x_array_init

Passed

N/A

0.670000s

c9x_recursive_init

Passed

N/A

0.670000s

cast_init

Passed

N/A

0.670960s

cast_init2

Passed

N/A

0.682735s

cast_lhs

Passed

N/A

0.650000s

compound_literals1

Passed

N/A

0.652045s

compound_literals2

Passed

N/A

0.650000s

constant_conv1

Passed

N/A

0.655562s

constant_conv2

Passed

N/A

0.700000s

cvt_in_ternary

Passed

N/A

0.684207s

ellipsis_in_switch

Passed

N/A

0.670396s

gcc_compound_statements1

Passed

N/A

0.680000s

gcc_compound_statements2

Passed

N/A

0.660000s

gcc_compound_statements3

Passed

N/A

0.701298s

gcc_func

Passed

N/A

0.650000s

gcc_variable_array_init

Passed

N/A

0.660000s

incorrect_array_size

Passed

N/A

0.667662s

long_double_int

Passed

N/A

0.667504s

nested_structs

Passed

N/A

0.675161s

nolimit_init

Passed

N/A

0.663579s

packed_structs

Passed

N/A

0.686654s

shift_to_narrower_type

Passed

N/A

0.670000s

type_conv1

Passed

N/A

0.672217s

type_conv2

Passed

N/A

0.692259s

type_conv3

Passed

N/A

0.660000s

zero_sized_arrays

Passed

N/A

0.657255s

usr.sbin/mtree/t_mtree

5.149723s

check

Passed

N/A

0.600000s

convert_C

Passed

N/A

0.470556s

convert_C_S

Passed

N/A

0.360000s

convert_D

Passed

N/A

0.362363s

convert_D_S

Passed

N/A

0.366613s

create

Passed

N/A

0.609475s

ignore

Passed

N/A

0.870411s

merge

Passed

N/A

0.584590s

nonemptydir

Passed

N/A

0.733362s

usr.sbin/tcpdump/t_tcpdump

4.620000s

promiscuous

Passed

N/A

4.584682s

usr.sbin/traceroute/t_traceroute

10.604768s

basic

Passed

N/A

5.330000s

basic_icmp

Passed

N/A

5.220000s

usr.sbin/useradd/t_useradd

1.344676s

longname

Expected failure

PR bin/39546: atf-check failed; see the output of the test for details

1.319645s

Failed test cases summary

Test case

Result

Reason

Duration

ipf/t_logging

1.329930s

l1

Failed

atf-check failed; see the output of the test for details

1.267072s

lib/libc/sys/t_sigaction

0.180000s

sigaction_resethand

Failed

Child process did not exit cleanly; it either failed to process the signal or SA_RESETHAND is broken; raw exit status was 139

0.070000s

modules/t_modctl

0.790000s

cmd_load

Failed

Module load failed

0.200000s

cmd_load_props

Failed

Module load failed

0.138118s

cmd_load_recurse

Failed

Module load failed

0.130000s

cmd_stat

Failed

Module load failed

0.134414s

cmd_unload

Failed

Module load failed

0.130000s

Expected failures summary

Test case

Result

Reason

Duration

bin/sh/t_expand

1.740000s

strip

Expected failure

PR bin/43469: $stripped != ${line%%/\**} (#define bindir "/usr/bin" != #define bindir ")

0.290000s

fs/ffs/t_mount

1.350000s

48Kimage

Expected failure

PR kern/43573: mount failed: Invalid argument

0.580000s

fs/nfs/t_mountd

13.360000s

mountdhup

Expected failure

PR kern/5844: race did not trigger this time

13.311997s

fs/vfs/t_renamerace

145.900670s

msdosfs_renamerace

Expected failure

PR kern/44661: unmount failed: Device busy

5.991061s

msdosfs_renamerace_dirs

Expected signal

PR kern/43626

8.468500s

fs/vfs/t_vfsops

98.700000s

lfs_tfhremove

Expected failure

fhopen() for removed file succeeds (PR kern/43745): /tmp/bracket/build/2012.06.14.20.18.16-sparc/src/tests/fs/vfs/t_vfsops.c:152: Expected true value in rump_sys_fhopen(fhp, fhsize, O_RDONLY) == -1

2.931820s

include/t_errno

0.060000s

errno_constants

Expected failure

PR standards/44921: 2 checks failed as expected; see output for more details

0.051909s

include/t_netdb

0.050000s

netdb_constants

Expected failure

PR standards/44777: 2 checks failed as expected; see output for more details

0.050000s

lib/libc/sys/t_getrusage

25.841064s

getrusage_utime_back

Expected failure

PR kern/30115: anticipated error did not occur

17.162599s

getrusage_utime_zero

Expected failure

PR kern/30115: anticipated error did not occur

8.600000s

lib/libm/t_pow

0.930000s

pow_one_neg_x

Expected failure

PR lib/45372: 2 checks failed as expected; see output for more details

0.050000s

pow_zero_x

Expected failure

PR port-amd64/45391: 3 checks failed as expected; see output for more details

0.041219s

powf_one_neg_x

Expected failure

PR lib/45372: 2 checks failed as expected; see output for more details

0.040000s

powf_zero_x

Expected failure

PR port-amd64/45391: 3 checks failed as expected; see output for more details

0.043900s

lib/libpthread/t_cond

10.620000s

cond_timedwait_race

Expected failure

PR lib/44756: /tmp/bracket/build/2012.06.14.20.18.16-sparc/src/tests/lib/libpthread/t_cond.c:338: rv == ETIMEDOUT not met

1.624842s

sbin/resize_ffs/t_shrink

244.923007s

shrink_24M_16M_v2_4096

Expected failure

PR bin/44205: atf-check failed; see the output of the test for details

67.780000s

sbin/resize_ffs/t_shrink_swapped

273.407234s

shrink_24M_16M_v2_16384

Expected failure

PR bin/44205: atf-check failed; see the output of the test for details

69.900370s

usr.bin/sed/t_sed

4.570000s

emptybackref

Expected failure

PR bin/28126: atf-check failed; see the output of the test for details

0.810382s

usr.sbin/useradd/t_useradd

1.344676s

longname

Expected failure

PR bin/39546: atf-check failed; see the output of the test for details

1.319645s

Skipped test cases summary

Test case

Result

Reason

Duration

atf/atf-c/pkg_config_test

0.040000s

build

Skipped

Required program 'pkg-config' not found in the PATH

0.010000s

version

Skipped

Required program 'pkg-config' not found in the PATH

0.005561s

atf/atf-c++/pkg_config_test

0.053483s

build

Skipped

Required program 'pkg-config' not found in the PATH

0.020000s

version

Skipped

Required program 'pkg-config' not found in the PATH

0.009245s

crypto/libcrypto/t_ciphers

13.680000s

idea

Skipped

IDEA support not available; system built with MKCRYPTO_IDEA=no

0.410000s

rc5

Skipped

RC5 support not available; system built with MKCRYPTO_RC5=no

0.370000s

crypto/libcrypto/t_hashes

3.680000s

mdc2

Skipped

MDC2 support not available; system built with MKCRYPTO_MDC2=no

0.338564s

examples/t_asm

1.229731s

hello

Skipped

Example program not implemented on this platform

1.190000s

fs/vfs/t_full

71.170000s

p2k_ffs_fillfs

Skipped

fs does not support explicit block allocation (GOP_ALLOC)

1.924314s

puffs_fillfs

Skipped

fs does not support explicit block allocation (GOP_ALLOC)

0.840000s

rumpfs_fillfs

Skipped

fs does not support explicit block allocation (GOP_ALLOC)

0.630000s

fs/vfs/t_renamerace

145.900670s

rumpfs_renamerace

Skipped

rename not supported by file system

0.780000s

rumpfs_renamerace_dirs

Skipped

rename not supported by file system

0.672370s

sysvbfs_renamerace_dirs

Skipped

directories not supported by file system

0.834060s

fs/vfs/t_rmdirrace

147.507269s

sysvbfs_race

Skipped

directories not supported by file system

0.726493s

fs/vfs/t_union

37.360000s

ext2fs_basic

Skipped

fs does not support VOP_WHITEOUT

0.944339s

ext2fs_whiteout

Skipped

fs does not support VOP_WHITEOUT

1.190000s

msdosfs_basic

Skipped

fs does not support VOP_WHITEOUT

0.905439s

msdosfs_whiteout

Skipped

fs does not support VOP_WHITEOUT

1.160346s

nfs_basic

Skipped

fs does not support VOP_WHITEOUT

2.160000s

nfs_whiteout

Skipped

fs does not support VOP_WHITEOUT

2.460400s

p2k_ffs_basic

Skipped

fs does not support VOP_WHITEOUT

1.398738s

p2k_ffs_whiteout

Skipped

fs does not support VOP_WHITEOUT

4.760000s

puffs_basic

Skipped

fs does not support VOP_WHITEOUT

0.860000s

puffs_whiteout

Skipped

fs does not support VOP_WHITEOUT

1.070000s

sysvbfs_basic

Skipped

fs does not support VOP_WHITEOUT

0.843442s

sysvbfs_whiteout

Skipped

fs does not support VOP_WHITEOUT

1.051041s

v7fs_basic

Skipped

fs does not support VOP_WHITEOUT

1.105523s

v7fs_whiteout

Skipped

fs does not support VOP_WHITEOUT

1.390000s

fs/vfs/t_unpriv

64.430000s

msdosfs_owner

Skipped

owner not supported by file system

0.890564s

nfs_flags

Skipped

file flags not supported by file system

3.290000s

puffs_flags

Skipped

file flags not supported by file system

0.750000s

sysvbfs_dirperms

Skipped

directories not supported by file system

0.800000s

sysvbfs_flags

Skipped

file flags not supported by file system

0.880118s

fs/vfs/t_vfsops

98.700000s

rumpfs_tfhinval

Skipped

file handles not supported

0.700000s

rumpfs_tfhremove

Skipped

file handles not supported

0.760000s

rumpfs_tfilehandle

Skipped

file handles not supported

0.670000s

sysvbfs_tfhinval

Skipped

file handles not supported

0.842572s

sysvbfs_tfhremove

Skipped

file handles not supported

0.829498s

sysvbfs_tfilehandle

Skipped

file handles not supported

0.909942s

v7fs_tfhinval

Skipped

file handles not supported

1.106424s

v7fs_tfhremove

Skipped

file handles not supported

1.130000s

v7fs_tfilehandle

Skipped

file handles not supported

1.130000s

fs/vfs/t_vnops

319.880000s

msdosfs_symlink_root

Skipped

symlinks not supported by file system

1.020000s

msdosfs_symlink_zerolen

Skipped

symlinks not supported by file system

1.050000s

rumpfs_rename_dir

Skipped

rename not supported by file system

0.738390s

rumpfs_rename_dotdot

Skipped

rename not supported by file system

0.720000s

rumpfs_rename_nametoolong

Skipped

rename not supported by file system

0.730000s

rumpfs_rename_reg_nodir

Skipped

rename not supported by file system

0.720000s

sysvbfs_dir_notempty

Skipped

directories not supported by file system

0.944826s

sysvbfs_dir_rmdirdotdot

Skipped

directories not supported by file system

0.990000s

sysvbfs_dir_simple

Skipped

directories not supported by file system

0.948102s

sysvbfs_lookup_complex

Skipped

directories not supported by file system

0.960000s

sysvbfs_rename_dir

Skipped

directories not supported by file system

0.950000s

sysvbfs_rename_dotdot

Skipped

directories not supported by file system

0.940000s

sysvbfs_symlink_root

Skipped

symlinks not supported by file system

0.970000s

sysvbfs_symlink_zerolen

Skipped

symlinks not supported by file system

0.960000s

games/t_factor

0.040000s

loop

Skipped

Required program '/usr/games/factor' not found in the PATH

0.009666s

overflow

Skipped

Required program '/usr/games/factor' not found in the PATH

0.007813s

include/t_paths

0.040000s

paths

Skipped

PR port-sparc/45580

0.040000s

ipf/t_filter_exec

50.569425s

f18

Skipped

This test case is probably broken

0.390000s

ipf/t_filter_parse

14.490000s

i17

Skipped

This test case is probably broken

0.387477s

ipf/t_nat_exec

3.960000s

n10

Skipped

This test case is probably broken

0.260892s

n12

Skipped

This test case is probably broken

0.250000s

n13

Skipped

This test case is probably broken

0.250000s

n14

Skipped

This test case is probably broken

0.250000s

n3

Skipped

This test case is probably broken

0.370000s

n7

Skipped

This test case is probably broken

0.310000s

n8

Skipped

This test case is probably broken

0.250000s

n9

Skipped

This test case is probably broken

0.260000s

ipf/t_nat_ipf_exec

5.012482s

ni1

Skipped

This test case is probably broken

0.260000s

ni13

Skipped

This test case is probably broken

0.262584s

ni14

Skipped

This test case is probably broken

0.260000s

ni15

Skipped

This test case is probably broken

0.262880s

ni16

Skipped

This test case is probably broken

0.330646s

ni2

Skipped

This test case is probably broken

0.321009s

ni3

Skipped

This test case is probably broken

0.370000s

ni4

Skipped

This test case is probably broken

0.260000s

ni6

Skipped

This test case is probably broken

0.254567s

ni7

Skipped

This test case is probably broken

0.252278s

ni8

Skipped

This test case is probably broken

0.250815s

ni9

Skipped

This test case is probably broken

0.290000s

lib/libc/regex/t_exhaust

0.030000s

regcomp_too_big

Skipped

Not enough memory; needed 125829120, available 32604160

0.015859s

lib/libc/stdlib/t_strtod

0.534790s

strtold_inf

Skipped

Requires long double support

0.041742s

strtold_nan

Skipped

Requires long double support

0.040000s

lib/libc/string/t_popcount

0.082223s

popcount_basic

Skipped

config variable "run_popcount" not set to YES/TRUE

0.031153s

popcountll_basic

Skipped

config variable "run_popcount" not set to YES/TRUE

0.031240s

lib/libc/sys/t_kevent

0.100000s

kqueue_desc_passing

Skipped

PR kern/46523

0.040851s

lib/libc/sys/t_mincore

0.174271s

mincore_resid

Skipped

mlockall() exceeded process resource limits

0.073159s

lib/libc/sys/t_mmap

0.560000s

mmap_block

Skipped

The test case causes a panic (PR kern/38889, kern/46592)

0.037761s

lib/libc/sys/t_mprotect

0.232579s

mprotect_exec

Skipped

Execute protection callback check not implemented

0.030000s

lib/libexecinfo/t_backtrace

0.059941s

backtrace_fmt_basic

Skipped

PR toolchain/46490: libexecinfo only works on amd64 currently

0.040000s

lib/libm/t_scalbn

0.736765s

scalbnl_inf_neg

Skipped

Requires long double support

0.040000s

scalbnl_inf_pos

Skipped

Requires long double support

0.040000s

scalbnl_nan

Skipped

Requires long double support

0.038356s

scalbnl_zero_neg

Skipped

Requires long double support

0.040000s

scalbnl_zero_pos

Skipped

Requires long double support

0.040000s

lib/librumphijack/t_tcpip

25.767259s

nfs_autoload

Skipped

test currently valid only on i386

0.970000s

lib/libtre/t_exhaust

0.040000s

regcomp_too_big

Skipped

Not enough memory; needed 125829120, available 32604160

0.008861s

modules/t_abi_uvm

0.890000s

PAGE_SIZE

Skipped

host does not support modules

0.870000s

modules/t_modload

4.550000s

iflag

Skipped

host does not support modules

0.878752s

plain

Skipped

host does not support modules

0.810000s

sflag

Skipped

host does not support modules

0.810000s

rump/rumpkern/t_kern

2.150000s

lockme_DOUBLEINIT

Skipped

test requires LOCKDEBUG kernel

0.050000s

lockme_MEMFREE

Skipped

test requires LOCKDEBUG kernel

0.050000s

lockme_RWRX

Skipped

test requires LOCKDEBUG kernel

0.056967s

rump/modautoload/t_modautoload

0.060000s

modautoload

Skipped

host kernel modules not supported on this architecture

0.040000s

usr.bin/cc/t_hello

6.470000s

hello32

Skipped

this is not a 64 bit architecture

0.716098s

Execution details

Environment variables

Test case: atf/atf-c/pkg_config_test/build

Duration: 0.010000 seconds

Termination reason

SKIPPED: Required program 'pkg-config' not found in the PATH

Test case: atf/atf-c/pkg_config_test/version

Duration: 0.005561 seconds

Termination reason

SKIPPED: Required program 'pkg-config' not found in the PATH

Test case: atf/atf-c++/pkg_config_test/build

Duration: 0.020000 seconds

Termination reason

SKIPPED: Required program 'pkg-config' not found in the PATH

Test case: atf/atf-c++/pkg_config_test/version

Duration: 0.009245 seconds

Termination reason

SKIPPED: Required program 'pkg-config' not found in the PATH

Test case: bin/sh/t_expand/strip

Duration: 0.290000 seconds

Termination reason

XFAIL: PR bin/43469: $stripped != ${line%%/\**} (#define bindir "/usr/bin" != #define bindir ")

Test case: crypto/libcrypto/t_ciphers/idea

Duration: 0.410000 seconds

Termination reason

SKIPPED: IDEA support not available; system built with MKCRYPTO_IDEA=no

Test case: crypto/libcrypto/t_ciphers/rc5

Duration: 0.370000 seconds

Termination reason

SKIPPED: RC5 support not available; system built with MKCRYPTO_RC5=no

Test case: crypto/libcrypto/t_hashes/mdc2

Duration: 0.338564 seconds

Termination reason

SKIPPED: MDC2 support not available; system built with MKCRYPTO_MDC2=no

Test case: examples/t_asm/hello

Duration: 1.190000 seconds

Termination reason

SKIPPED: Example program not implemented on this platform

Test case: fs/ffs/t_mount/48Kimage

Duration: 0.580000 seconds

Termination reason

XFAIL: PR kern/43573: mount failed: Invalid argument

Standard output stream

rn_init: radix functions require max_keylen be set

Test case: fs/nfs/t_mountd/mountdhup

Duration: 13.311997 seconds

Termination reason

XFAIL: PR kern/5844: race did not trigger this time

Standard output stream

10.3.2.1:/myexport: inaccurate wcc data (ctime) detected, disabling wcc (ctime 1340235341.554218999 1340235341.554218999, mtime 1340235341.554218999 1340235341.554218999)

Standard error stream

rumpnfsd: Cannot get information for `udp6'
rumpnfsd: Cannot get information for `tcp6'
Getting export list.
Got line 
Got line /myexport -noresvport -noresvmnt -maproot=0:0 10.3.2.2
Making new ep fs=0xc500,0x78b
doing opt -noresvport -noresvmnt -maproot=0:0 10.3.2.2
doing opt -noresvmnt -maproot=0:0 10.3.2.2
doing opt -maproot=0:0 10.3.2.2
got host 10.3.2.2
Got line /myexport -ro -noresvport -noresvmnt -maproot=0:0 10.4.2.2
Found ep fs=0xc500,0x78b
doing opt -ro -noresvport -noresvmnt -maproot=0:0 10.4.2.2
doing opt -noresvport -noresvmnt -maproot=0:0 10.4.2.2
doing opt -noresvmnt -maproot=0:0 10.4.2.2
doing opt -maproot=0:0 10.4.2.2
got host 10.4.2.2
Getting mount list.
Here we go.
got mount request from 10.3.2.2
-> rpcpath: /myexport
-> dpath: /myexport
Mount successful.
Got line 
Got line /myexport -noresvport -noresvmnt -maproot=0:0 10.3.2.2
Making new ep fs=0xc500,0x78b
doing opt -noresvport -noresvmnt -maproot=0:0 10.3.2.2
doing opt -noresvmnt -maproot=0:0 10.3.2.2
doing opt -maproot=0:0 10.3.2.2
got host 10.3.2.2
Got line /myexport -ro -noresvport -noresvmnt -maproot=0:0 10.4.2.2
Found ep fs=0xc500,0x78b
doing opt -ro -noresvport -noresvmnt -maproot=0:0 10.4.2.2
doing opt -noresvport -noresvmnt -maproot=0:0 10.4.2.2
doing opt -noresvmnt -maproot=0:0 10.4.2.2
doing opt -maproot=0:0 10.4.2.2
got host 10.4.2.2
Got line 
Got line /myexport -noresvport -noresvmnt -maproot=0:0 10.3.2.2
Making new ep fs=0xc500,0x78b
doing opt -noresvport -noresvmnt -maproot=0:0 10.3.2.2
doing opt -noresvmnt -maproot=0:0 10.3.2.2
doing opt -maproot=0:0 10.3.2.2
got host 10.3.2.2
Got line /myexport -ro -noresvport -noresvmnt -maproot=0:0 10.4.2.2
Found ep fs=0xc500,0x78b
doing opt -ro -noresvport -noresvmnt -maproot=0:0 10.4.2.2
doing opt -noresvport -noresvmnt -maproot=0:0 10.4.2.2
doing opt -noresvmnt -maproot=0:0 10.4.2.2
doing opt -maproot=0:0 10.4.2.2
got host 10.4.2.2
Got line 
Got line /myexport -noresvport -noresvmnt -maproot=0:0 10.3.2.2
Making new ep fs=0xc500,0x78b
doing opt -noresvport -noresvmnt -maproot=0:0 10.3.2.2
doing opt -noresvmnt -maproot=0:0 10.3.2.2
doing opt -maproot=0:0 10.3.2.2
got host 10.3.2.2
Got line /myexport -ro -noresvport -noresvmnt -maproot=0:0 10.4.2.2
Found ep fs=0xc500,0x78b
doing opt -ro -noresvport -noresvmnt -maproot=0:0 10.4.2.2
doing opt -noresvport -noresvmnt -maproot=0:0 10.4.2.2
doing opt -noresvmnt -maproot=0:0 10.4.2.2
doing opt -maproot=0:0 10.4.2.2
got host 10.4.2.2
Got line 
Got line /myexport -noresvport -noresvmnt -maproot=0:0 10.3.2.2
Making new ep fs=0xc500,0x78b
doing opt -noresvport -noresvmnt -maproot=0:0 10.3.2.2
doing opt -noresvmnt -maproot=0:0 10.3.2.2
doing opt -maproot=0:0 10.3.2.2
got host 10.3.2.2
Got line /myexport -ro -noresvport -noresvmnt -maproot=0:0 10.4.2.2
Found ep fs=0xc500,0x78b
doing opt -ro -noresvport -noresvmnt -maproot=0:0 10.4.2.2
doing opt -noresvport -noresvmnt -maproot=0:0 10.4.2.2
doing opt -noresvmnt -maproot=0:0 10.4.2.2
doing opt -maproot=0:0 10.4.2.2
got host 10.4.2.2
Got line 
Got line /myexport -noresvport -noresvmnt -maproot=0:0 10.3.2.2
Making new ep fs=0xc500,0x78b
doing opt -noresvport -noresvmnt -maproot=0:0 10.3.2.2
doing opt -noresvmnt -maproot=0:0 10.3.2.2
doing opt -maproot=0:0 10.3.2.2
got host 10.3.2.2
Got line /myexport -ro -noresvport -noresvmnt -maproot=0:0 10.4.2.2
Found ep fs=0xc500,0x78b
doing opt -ro -noresvport -noresvmnt -maproot=0:0 10.4.2.2
doing opt -noresvport -noresvmnt -maproot=0:0 10.4.2.2
doing opt -noresvmnt -maproot=0:0 10.4.2.2
doing opt -maproot=0:0 10.4.2.2
got host 10.4.2.2
Got line 
Got line /myexport -noresvport -noresvmnt -maproot=0:0 10.3.2.2
Making new ep fs=0xc500,0x78b
doing opt -noresvport -noresvmnt -maproot=0:0 10.3.2.2
doing opt -noresvmnt -maproot=0:0 10.3.2.2
doing opt -maproot=0:0 10.3.2.2
got host 10.3.2.2
Got line /myexport -ro -noresvport -noresvmnt -maproot=0:0 10.4.2.2
Found ep fs=0xc500,0x78b
doing opt -ro -noresvport -noresvmnt -maproot=0:0 10.4.2.2
doing opt -noresvport -noresvmnt -maproot=0:0 10.4.2.2
doing opt -noresvmnt -maproot=0:0 10.4.2.2
doing opt -maproot=0:0 10.4.2.2
got host 10.4.2.2
Got line 
Got line /myexport -noresvport -noresvmnt -maproot=0:0 10.3.2.2
Making new ep fs=0xc500,0x78b
doing opt -noresvport -noresvmnt -maproot=0:0 10.3.2.2
doing opt -noresvmnt -maproot=0:0 10.3.2.2
doing opt -maproot=0:0 10.3.2.2
got host 10.3.2.2
Got line /myexport -ro -noresvport -noresvmnt -maproot=0:0 10.4.2.2
Found ep fs=0xc500,0x78b
doing opt -ro -noresvport -noresvmnt -maproot=0:0 10.4.2.2
doing opt -noresvport -noresvmnt -maproot=0:0 10.4.2.2
doing opt -noresvmnt -maproot=0:0 10.4.2.2
doing opt -maproot=0:0 10.4.2.2
got host 10.4.2.2
Got line 
Got line /myexport -noresvport -noresvmnt -maproot=0:0 10.3.2.2
Making new ep fs=0xc500,0x78b
doing opt -noresvport -noresvmnt -maproot=0:0 10.3.2.2
doing opt -noresvmnt -maproot=0:0 10.3.2.2
doing opt -maproot=0:0 10.3.2.2
got host 10.3.2.2
Got line /myexport -ro -noresvport -noresvmnt -maproot=0:0 10.4.2.2
Found ep fs=0xc500,0x78b
doing opt -ro -noresvport -noresvmnt -maproot=0:0 10.4.2.2
doing opt -noresvport -noresvmnt -maproot=0:0 10.4.2.2
doing opt -noresvmnt -maproot=0:0 10.4.2.2
doing opt -maproot=0:0 10.4.2.2
got host 10.4.2.2
Got line 
Got line /myexport -noresvport -noresvmnt -maproot=0:0 10.3.2.2
Making new ep fs=0xc500,0x78b
doing opt -noresvport -noresvmnt -maproot=0:0 10.3.2.2
doing opt -noresvmnt -maproot=0:0 10.3.2.2
doing opt -maproot=0:0 10.3.2.2
got host 10.3.2.2
Got line /myexport -ro -noresvport -noresvmnt -maproot=0:0 10.4.2.2
Found ep fs=0xc500,0x78b
doing opt -ro -noresvport -noresvmnt -maproot=0:0 10.4.2.2
doing opt -noresvport -noresvmnt -maproot=0:0 10.4.2.2
doing opt -noresvmnt -maproot=0:0 10.4.2.2
doing opt -maproot=0:0 10.4.2.2
got host 10.4.2.2
Got line 
Got line /myexport -noresvport -noresvmnt -maproot=0:0 10.3.2.2
Making new ep fs=0xc500,0x78b
doing opt -noresvport -noresvmnt -maproot=0:0 10.3.2.2
doing opt -noresvmnt -maproot=0:0 10.3.2.2
doing opt -maproot=0:0 10.3.2.2
got host 10.3.2.2
Got line /myexport -ro -noresvport -noresvmnt -maproot=0:0 10.4.2.2
Found ep fs=0xc500,0x78b
doing opt -ro -noresvport -noresvmnt -maproot=0:0 10.4.2.2
doing opt -noresvport -noresvmnt -maproot=0:0 10.4.2.2
doing opt -noresvmnt -maproot=0:0 10.4.2.2
doing opt -maproot=0:0 10.4.2.2
got host 10.4.2.2
Got line 
Got line /myexport -noresvport -noresvmnt -maproot=0:0 10.3.2.2
Making new ep fs=0xc500,0x78b
doing opt -noresvport -noresvmnt -maproot=0:0 10.3.2.2
doing opt -noresvmnt -maproot=0:0 10.3.2.2
doing opt -maproot=0:0 10.3.2.2
got host 10.3.2.2
Got line /myexport -ro -noresvport -noresvmnt -maproot=0:0 10.4.2.2
Found ep fs=0xc500,0x78b
doing opt -ro -noresvport -noresvmnt -maproot=0:0 10.4.2.2
doing opt -noresvport -noresvmnt -maproot=0:0 10.4.2.2
doing opt -noresvmnt -maproot=0:0 10.4.2.2
doing opt -maproot=0:0 10.4.2.2
got host 10.4.2.2
Got line 
Got line /myexport -noresvport -noresvmnt -maproot=0:0 10.3.2.2
Making new ep fs=0xc500,0x78b
doing opt -noresvport -noresvmnt -maproot=0:0 10.3.2.2
doing opt -noresvmnt -maproot=0:0 10.3.2.2
doing opt -maproot=0:0 10.3.2.2
got host 10.3.2.2
Got line /myexport -ro -noresvport -noresvmnt -maproot=0:0 10.4.2.2
Found ep fs=0xc500,0x78b
doing opt -ro -noresvport -noresvmnt -maproot=0:0 10.4.2.2
doing opt -noresvport -noresvmnt -maproot=0:0 10.4.2.2
doing opt -noresvmnt -maproot=0:0 10.4.2.2
doing opt -maproot=0:0 10.4.2.2
got host 10.4.2.2
Got line 
Got line /myexport -noresvport -noresvmnt -maproot=0:0 10.3.2.2
Making new ep fs=0xc500,0x78b
doing opt -noresvport -noresvmnt -maproot=0:0 10.3.2.2
doing opt -noresvmnt -maproot=0:0 10.3.2.2
doing opt -maproot=0:0 10.3.2.2
got host 10.3.2.2
Got line /myexport -ro -noresvport -noresvmnt -maproot=0:0 10.4.2.2
Found ep fs=0xc500,0x78b
doing opt -ro -noresvport -noresvmnt -maproot=0:0 10.4.2.2
doing opt -noresvport -noresvmnt -maproot=0:0 10.4.2.2
doing opt -noresvmnt -maproot=0:0 10.4.2.2
doing opt -maproot=0:0 10.4.2.2
got host 10.4.2.2
Got line 
Got line /myexport -noresvport -noresvmnt -maproot=0:0 10.3.2.2
Making new ep fs=0xc500,0x78b
doing opt -noresvport -noresvmnt -maproot=0:0 10.3.2.2
doing opt -noresvmnt -maproot=0:0 10.3.2.2
doing opt -maproot=0:0 10.3.2.2
got host 10.3.2.2
Got line /myexport -ro -noresvport -noresvmnt -maproot=0:0 10.4.2.2
Found ep fs=0xc500,0x78b
doing opt -ro -noresvport -noresvmnt -maproot=0:0 10.4.2.2
doing opt -noresvport -noresvmnt -maproot=0:0 10.4.2.2
doing opt -noresvmnt -maproot=0:0 10.4.2.2
doing opt -maproot=0:0 10.4.2.2
got host 10.4.2.2
Got line 
Got line /myexport -noresvport -noresvmnt -maproot=0:0 10.3.2.2
Making new ep fs=0xc500,0x78b
doing opt -noresvport -noresvmnt -maproot=0:0 10.3.2.2
doing opt -noresvmnt -maproot=0:0 10.3.2.2
doing opt -maproot=0:0 10.3.2.2
got host 10.3.2.2
Got line /myexport -ro -noresvport -noresvmnt -maproot=0:0 10.4.2.2
Found ep fs=0xc500,0x78b
doing opt -ro -noresvport -noresvmnt -maproot=0:0 10.4.2.2
doing opt -noresvport -noresvmnt -maproot=0:0 10.4.2.2
doing opt -noresvmnt -maproot=0:0 10.4.2.2
doing opt -maproot=0:0 10.4.2.2
got host 10.4.2.2
Got line 
Got line /myexport -noresvport -noresvmnt -maproot=0:0 10.3.2.2
Making new ep fs=0xc500,0x78b
doing opt -noresvport -noresvmnt -maproot=0:0 10.3.2.2
doing opt -noresvmnt -maproot=0:0 10.3.2.2
doing opt -maproot=0:0 10.3.2.2
got host 10.3.2.2
Got line /myexport -ro -noresvport -noresvmnt -maproot=0:0 10.4.2.2
Found ep fs=0xc500,0x78b
doing opt -ro -noresvport -noresvmnt -maproot=0:0 10.4.2.2
doing opt -noresvport -noresvmnt -maproot=0:0 10.4.2.2
doing opt -noresvmnt -maproot=0:0 10.4.2.2
doing opt -maproot=0:0 10.4.2.2
got host 10.4.2.2
Got line 
Got line /myexport -noresvport -noresvmnt -maproot=0:0 10.3.2.2
Making new ep fs=0xc500,0x78b
doing opt -noresvport -noresvmnt -maproot=0:0 10.3.2.2
doing opt -noresvmnt -maproot=0:0 10.3.2.2
doing opt -maproot=0:0 10.3.2.2
got host 10.3.2.2
Got line /myexport -ro -noresvport -noresvmnt -maproot=0:0 10.4.2.2
Found ep fs=0xc500,0x78b
doing opt -ro -noresvport -noresvmnt -maproot=0:0 10.4.2.2
doing opt -noresvport -noresvmnt -maproot=0:0 10.4.2.2
doing opt -noresvmnt -maproot=0:0 10.4.2.2
doing opt -maproot=0:0 10.4.2.2
got host 10.4.2.2
Got line 
Got line /myexport -noresvport -noresvmnt -maproot=0:0 10.3.2.2
Making new ep fs=0xc500,0x78b
doing opt -noresvport -noresvmnt -maproot=0:0 10.3.2.2
doing opt -noresvmnt -maproot=0:0 10.3.2.2
doing opt -maproot=0:0 10.3.2.2
got host 10.3.2.2
Got line /myexport -ro -noresvport -noresvmnt -maproot=0:0 10.4.2.2
Found ep fs=0xc500,0x78b
doing opt -ro -noresvport -noresvmnt -maproot=0:0 10.4.2.2
doing opt -noresvport -noresvmnt -maproot=0:0 10.4.2.2
doing opt -noresvmnt -maproot=0:0 10.4.2.2
doing opt -maproot=0:0 10.4.2.2
got host 10.4.2.2
Got line 
Got line /myexport -noresvport -noresvmnt -maproot=0:0 10.3.2.2
Making new ep fs=0xc500,0x78b
doing opt -noresvport -noresvmnt -maproot=0:0 10.3.2.2
doing opt -noresvmnt -maproot=0:0 10.3.2.2
doing opt -maproot=0:0 10.3.2.2
got host 10.3.2.2
Got line /myexport -ro -noresvport -noresvmnt -maproot=0:0 10.4.2.2
Found ep fs=0xc500,0x78b
doing opt -ro -noresvport -noresvmnt -maproot=0:0 10.4.2.2
doing opt -noresvport -noresvmnt -maproot=0:0 10.4.2.2
doing opt -noresvmnt -maproot=0:0 10.4.2.2
doing opt -maproot=0:0 10.4.2.2
got host 10.4.2.2
Got line 
Got line /myexport -noresvport -noresvmnt -maproot=0:0 10.3.2.2
Making new ep fs=0xc500,0x78b
doing opt -noresvport -noresvmnt -maproot=0:0 10.3.2.2
doing opt -noresvmnt -maproot=0:0 10.3.2.2
doing opt -maproot=0:0 10.3.2.2
got host 10.3.2.2
Got line /myexport -ro -noresvport -noresvmnt -maproot=0:0 10.4.2.2
Found ep fs=0xc500,0x78b
doing opt -ro -noresvport -noresvmnt -maproot=0:0 10.4.2.2
doing opt -noresvport -noresvmnt -maproot=0:0 10.4.2.2
doing opt -noresvmnt -maproot=0:0 10.4.2.2
doing opt -maproot=0:0 10.4.2.2
got host 10.4.2.2
Got line 
Got line /myexport -noresvport -noresvmnt -maproot=0:0 10.3.2.2
Making new ep fs=0xc500,0x78b
doing opt -noresvport -noresvmnt -maproot=0:0 10.3.2.2
doing opt -noresvmnt -maproot=0:0 10.3.2.2
doing opt -maproot=0:0 10.3.2.2
got host 10.3.2.2
Got line /myexport -ro -noresvport -noresvmnt -maproot=0:0 10.4.2.2
Found ep fs=0xc500,0x78b
doing opt -ro -noresvport -noresvmnt -maproot=0:0 10.4.2.2
doing opt -noresvport -noresvmnt -maproot=0:0 10.4.2.2
doing opt -noresvmnt -maproot=0:0 10.4.2.2
doing opt -maproot=0:0 10.4.2.2
got host 10.4.2.2
Got line 
Got line /myexport -noresvport -noresvmnt -maproot=0:0 10.3.2.2
Making new ep fs=0xc500,0x78b
doing opt -noresvport -noresvmnt -maproot=0:0 10.3.2.2
doing opt -noresvmnt -maproot=0:0 10.3.2.2
doing opt -maproot=0:0 10.3.2.2
got host 10.3.2.2
Got line /myexport -ro -noresvport -noresvmnt -maproot=0:0 10.4.2.2
Found ep fs=0xc500,0x78b
doing opt -ro -noresvport -noresvmnt -maproot=0:0 10.4.2.2
doing opt -noresvport -noresvmnt -maproot=0:0 10.4.2.2
doing opt -noresvmnt -maproot=0:0 10.4.2.2
doing opt -maproot=0:0 10.4.2.2
got host 10.4.2.2
Got line 
Got line /myexport -noresvport -noresvmnt -maproot=0:0 10.3.2.2
Making new ep fs=0xc500,0x78b
doing opt -noresvport -noresvmnt -maproot=0:0 10.3.2.2
doing opt -noresvmnt -maproot=0:0 10.3.2.2
doing opt -maproot=0:0 10.3.2.2
got host 10.3.2.2
Got line /myexport -ro -noresvport -noresvmnt -maproot=0:0 10.4.2.2
Found ep fs=0xc500,0x78b
doing opt -ro -noresvport -noresvmnt -maproot=0:0 10.4.2.2
doing opt -noresvport -noresvmnt -maproot=0:0 10.4.2.2
doing opt -noresvmnt -maproot=0:0 10.4.2.2
doing opt -maproot=0:0 10.4.2.2
got host 10.4.2.2
Got line 
Got line /myexport -noresvport -noresvmnt -maproot=0:0 10.3.2.2
Making new ep fs=0xc500,0x78b
doing opt -noresvport -noresvmnt -maproot=0:0 10.3.2.2
doing opt -noresvmnt -maproot=0:0 10.3.2.2
doing opt -maproot=0:0 10.3.2.2
got host 10.3.2.2
Got line /myexport -ro -noresvport -noresvmnt -maproot=0:0 10.4.2.2
Found ep fs=0xc500,0x78b
doing opt -ro -noresvport -noresvmnt -maproot=0:0 10.4.2.2
doing opt -noresvport -noresvmnt -maproot=0:0 10.4.2.2
doing opt -noresvmnt -maproot=0:0 10.4.2.2
doing opt -maproot=0:0 10.4.2.2
got host 10.4.2.2
Got line 
Got line /myexport -noresvport -noresvmnt -maproot=0:0 10.3.2.2
Making new ep fs=0xc500,0x78b
doing opt -noresvport -noresvmnt -maproot=0:0 10.3.2.2
doing opt -noresvmnt -maproot=0:0 10.3.2.2
doing opt -maproot=0:0 10.3.2.2
got host 10.3.2.2
Got line /myexport -ro -noresvport -noresvmnt -maproot=0:0 10.4.2.2
Found ep fs=0xc500,0x78b
doing opt -ro -noresvport -noresvmnt -maproot=0:0 10.4.2.2
doing opt -noresvport -noresvmnt -maproot=0:0 10.4.2.2
doing opt -noresvmnt -maproot=0:0 10.4.2.2
doing opt -maproot=0:0 10.4.2.2
got host 10.4.2.2
Got line 
Got line /myexport -noresvport -noresvmnt -maproot=0:0 10.3.2.2
Making new ep fs=0xc500,0x78b
doing opt -noresvport -noresvmnt -maproot=0:0 10.3.2.2
doing opt -noresvmnt -maproot=0:0 10.3.2.2
doing opt -maproot=0:0 10.3.2.2
got host 10.3.2.2
Got line /myexport -ro -noresvport -noresvmnt -maproot=0:0 10.4.2.2
Found ep fs=0xc500,0x78b
doing opt -ro -noresvport -noresvmnt -maproot=0:0 10.4.2.2
doing opt -noresvport -noresvmnt -maproot=0:0 10.4.2.2
doing opt -noresvmnt -maproot=0:0 10.4.2.2
doing opt -maproot=0:0 10.4.2.2
got host 10.4.2.2
Got line 
Got line /myexport -noresvport -noresvmnt -maproot=0:0 10.3.2.2
Making new ep fs=0xc500,0x78b
doing opt -noresvport -noresvmnt -maproot=0:0 10.3.2.2
doing opt -noresvmnt -maproot=0:0 10.3.2.2
doing opt -maproot=0:0 10.3.2.2
got host 10.3.2.2
Got line /myexport -ro -noresvport -noresvmnt -maproot=0:0 10.4.2.2
Found ep fs=0xc500,0x78b
doing opt -ro -noresvport -noresvmnt -maproot=0:0 10.4.2.2
doing opt -noresvport -noresvmnt -maproot=0:0 10.4.2.2
doing opt -noresvmnt -maproot=0:0 10.4.2.2
doing opt -maproot=0:0 10.4.2.2
got host 10.4.2.2
Got line 
Got line /myexport -noresvport -noresvmnt -maproot=0:0 10.3.2.2
Making new ep fs=0xc500,0x78b
doing opt -noresvport -noresvmnt -maproot=0:0 10.3.2.2
doing opt -noresvmnt -maproot=0:0 10.3.2.2
doing opt -maproot=0:0 10.3.2.2
got host 10.3.2.2
Got line /myexport -ro -noresvport -noresvmnt -maproot=0:0 10.4.2.2
Found ep fs=0xc500,0x78b
doing opt -ro -noresvport -noresvmnt -maproot=0:0 10.4.2.2
doing opt -noresvport -noresvmnt -maproot=0:0 10.4.2.2
doing opt -noresvmnt -maproot=0:0 10.4.2.2
doing opt -maproot=0:0 10.4.2.2
got host 10.4.2.2
Got line 
Got line /myexport -noresvport -noresvmnt -maproot=0:0 10.3.2.2
Making new ep fs=0xc500,0x78b
doing opt -noresvport -noresvmnt -maproot=0:0 10.3.2.2
doing opt -noresvmnt -maproot=0:0 10.3.2.2
doing opt -maproot=0:0 10.3.2.2
got host 10.3.2.2
Got line /myexport -ro -noresvport -noresvmnt -maproot=0:0 10.4.2.2
Found ep fs=0xc500,0x78b
doing opt -ro -noresvport -noresvmnt -maproot=0:0 10.4.2.2
doing opt -noresvport -noresvmnt -maproot=0:0 10.4.2.2
doing opt -noresvmnt -maproot=0:0 10.4.2.2
doing opt -maproot=0:0 10.4.2.2
got host 10.4.2.2
Got line 
Got line /myexport -noresvport -noresvmnt -maproot=0:0 10.3.2.2
Making new ep fs=0xc500,0x78b
doing opt -noresvport -noresvmnt -maproot=0:0 10.3.2.2
doing opt -noresvmnt -maproot=0:0 10.3.2.2
doing opt -maproot=0:0 10.3.2.2
got host 10.3.2.2
Got line /myexport -ro -noresvport -noresvmnt -maproot=0:0 10.4.2.2
Found ep fs=0xc500,0x78b
doing opt -ro -noresvport -noresvmnt -maproot=0:0 10.4.2.2
doing opt -noresvport -noresvmnt -maproot=0:0 10.4.2.2
doing opt -noresvmnt -maproot=0:0 10.4.2.2
doing opt -maproot=0:0 10.4.2.2
got host 10.4.2.2
Got line 
Got line /myexport -noresvport -noresvmnt -maproot=0:0 10.3.2.2
Making new ep fs=0xc500,0x78b
doing opt -noresvport -noresvmnt -maproot=0:0 10.3.2.2
doing opt -noresvmnt -maproot=0:0 10.3.2.2
doing opt -maproot=0:0 10.3.2.2
got host 10.3.2.2
Got line /myexport -ro -noresvport -noresvmnt -maproot=0:0 10.4.2.2
Found ep fs=0xc500,0x78b
doing opt -ro -noresvport -noresvmnt -maproot=0:0 10.4.2.2
doing opt -noresvport -noresvmnt -maproot=0:0 10.4.2.2
doing opt -noresvmnt -maproot=0:0 10.4.2.2
doing opt -maproot=0:0 10.4.2.2
got host 10.4.2.2
Got line 
Got line /myexport -noresvport -noresvmnt -maproot=0:0 10.3.2.2
Making new ep fs=0xc500,0x78b
doing opt -noresvport -noresvmnt -maproot=0:0 10.3.2.2
doing opt -noresvmnt -maproot=0:0 10.3.2.2
doing opt -maproot=0:0 10.3.2.2
got host 10.3.2.2
Got line /myexport -ro -noresvport -noresvmnt -maproot=0:0 10.4.2.2
Found ep fs=0xc500,0x78b
doing opt -ro -noresvport -noresvmnt -maproot=0:0 10.4.2.2
doing opt -noresvport -noresvmnt -maproot=0:0 10.4.2.2
doing opt -noresvmnt -maproot=0:0 10.4.2.2
doing opt -maproot=0:0 10.4.2.2
got host 10.4.2.2
Got line 
Got line /myexport -noresvport -noresvmnt -maproot=0:0 10.3.2.2
Making new ep fs=0xc500,0x78b
doing opt -noresvport -noresvmnt -maproot=0:0 10.3.2.2
doing opt -noresvmnt -maproot=0:0 10.3.2.2
doing opt -maproot=0:0 10.3.2.2
got host 10.3.2.2
Got line /myexport -ro -noresvport -noresvmnt -maproot=0:0 10.4.2.2
Found ep fs=0xc500,0x78b
doing opt -ro -noresvport -noresvmnt -maproot=0:0 10.4.2.2
doing opt -noresvport -noresvmnt -maproot=0:0 10.4.2.2
doing opt -noresvmnt -maproot=0:0 10.4.2.2
doing opt -maproot=0:0 10.4.2.2
got host 10.4.2.2
Got line 
Got line /myexport -noresvport -noresvmnt -maproot=0:0 10.3.2.2
Making new ep fs=0xc500,0x78b
doing opt -noresvport -noresvmnt -maproot=0:0 10.3.2.2
doing opt -noresvmnt -maproot=0:0 10.3.2.2
doing opt -maproot=0:0 10.3.2.2
got host 10.3.2.2
Got line /myexport -ro -noresvport -noresvmnt -maproot=0:0 10.4.2.2
Found ep fs=0xc500,0x78b
doing opt -ro -noresvport -noresvmnt -maproot=0:0 10.4.2.2
doing opt -noresvport -noresvmnt -maproot=0:0 10.4.2.2
doing opt -noresvmnt -maproot=0:0 10.4.2.2
doing opt -maproot=0:0 10.4.2.2
got host 10.4.2.2
Got line 
Got line /myexport -noresvport -noresvmnt -maproot=0:0 10.3.2.2
Making new ep fs=0xc500,0x78b
doing opt -noresvport -noresvmnt -maproot=0:0 10.3.2.2
doing opt -noresvmnt -maproot=0:0 10.3.2.2
doing opt -maproot=0:0 10.3.2.2
got host 10.3.2.2
Got line /myexport -ro -noresvport -noresvmnt -maproot=0:0 10.4.2.2
Found ep fs=0xc500,0x78b
doing opt -ro -noresvport -noresvmnt -maproot=0:0 10.4.2.2
doing opt -noresvport -noresvmnt -maproot=0:0 10.4.2.2
doing opt -noresvmnt -maproot=0:0 10.4.2.2
doing opt -maproot=0:0 10.4.2.2
got host 10.4.2.2
Got line 
Got line /myexport -noresvport -noresvmnt -maproot=0:0 10.3.2.2
Making new ep fs=0xc500,0x78b
doing opt -noresvport -noresvmnt -maproot=0:0 10.3.2.2
doing opt -noresvmnt -maproot=0:0 10.3.2.2
doing opt -maproot=0:0 10.3.2.2
got host 10.3.2.2
Got line /myexport -ro -noresvport -noresvmnt -maproot=0:0 10.4.2.2
Found ep fs=0xc500,0x78b
doing opt -ro -noresvport -noresvmnt -maproot=0:0 10.4.2.2
doing opt -noresvport -noresvmnt -maproot=0:0 10.4.2.2
doing opt -noresvmnt -maproot=0:0 10.4.2.2
doing opt -maproot=0:0 10.4.2.2
got host 10.4.2.2
Got line 
Got line /myexport -noresvport -noresvmnt -maproot=0:0 10.3.2.2
Making new ep fs=0xc500,0x78b
doing opt -noresvport -noresvmnt -maproot=0:0 10.3.2.2
doing opt -noresvmnt -maproot=0:0 10.3.2.2
doing opt -maproot=0:0 10.3.2.2
got host 10.3.2.2
Got line /myexport -ro -noresvport -noresvmnt -maproot=0:0 10.4.2.2
Found ep fs=0xc500,0x78b
doing opt -ro -noresvport -noresvmnt -maproot=0:0 10.4.2.2
doing opt -noresvport -noresvmnt -maproot=0:0 10.4.2.2
doing opt -noresvmnt -maproot=0:0 10.4.2.2
doing opt -maproot=0:0 10.4.2.2
got host 10.4.2.2
Got line 
Got line /myexport -noresvport -noresvmnt -maproot=0:0 10.3.2.2
Making new ep fs=0xc500,0x78b
doing opt -noresvport -noresvmnt -maproot=0:0 10.3.2.2
doing opt -noresvmnt -maproot=0:0 10.3.2.2
doing opt -maproot=0:0 10.3.2.2
got host 10.3.2.2
Got line /myexport -ro -noresvport -noresvmnt -maproot=0:0 10.4.2.2
Found ep fs=0xc500,0x78b
doing opt -ro -noresvport -noresvmnt -maproot=0:0 10.4.2.2
doing opt -noresvport -noresvmnt -maproot=0:0 10.4.2.2
doing opt -noresvmnt -maproot=0:0 10.4.2.2
doing opt -maproot=0:0 10.4.2.2
got host 10.4.2.2
Got line 
Got line /myexport -noresvport -noresvmnt -maproot=0:0 10.3.2.2
Making new ep fs=0xc500,0x78b
doing opt -noresvport -noresvmnt -maproot=0:0 10.3.2.2
doing opt -noresvmnt -maproot=0:0 10.3.2.2
doing opt -maproot=0:0 10.3.2.2
got host 10.3.2.2
Got line /myexport -ro -noresvport -noresvmnt -maproot=0:0 10.4.2.2
Found ep fs=0xc500,0x78b
doing opt -ro -noresvport -noresvmnt -maproot=0:0 10.4.2.2
doing opt -noresvport -noresvmnt -maproot=0:0 10.4.2.2
doing opt -noresvmnt -maproot=0:0 10.4.2.2
doing opt -maproot=0:0 10.4.2.2
got host 10.4.2.2
Got line 
Got line /myexport -noresvport -noresvmnt -maproot=0:0 10.3.2.2
Making new ep fs=0xc500,0x78b
doing opt -noresvport -noresvmnt -maproot=0:0 10.3.2.2
doing opt -noresvmnt -maproot=0:0 10.3.2.2
doing opt -maproot=0:0 10.3.2.2
got host 10.3.2.2
Got line /myexport -ro -noresvport -noresvmnt -maproot=0:0 10.4.2.2
Found ep fs=0xc500,0x78b
doing opt -ro -noresvport -noresvmnt -maproot=0:0 10.4.2.2
doing opt -noresvport -noresvmnt -maproot=0:0 10.4.2.2
doing opt -noresvmnt -maproot=0:0 10.4.2.2
doing opt -maproot=0:0 10.4.2.2
got host 10.4.2.2
Got line 
Got line /myexport -noresvport -noresvmnt -maproot=0:0 10.3.2.2
Making new ep fs=0xc500,0x78b
doing opt -noresvport -noresvmnt -maproot=0:0 10.3.2.2
doing opt -noresvmnt -maproot=0:0 10.3.2.2
doing opt -maproot=0:0 10.3.2.2
got host 10.3.2.2
Got line /myexport -ro -noresvport -noresvmnt -maproot=0:0 10.4.2.2
Found ep fs=0xc500,0x78b
doing opt -ro -noresvport -noresvmnt -maproot=0:0 10.4.2.2
doing opt -noresvport -noresvmnt -maproot=0:0 10.4.2.2
doing opt -noresvmnt -maproot=0:0 10.4.2.2
doing opt -maproot=0:0 10.4.2.2
got host 10.4.2.2
Got line 
Got line /myexport -noresvport -noresvmnt -maproot=0:0 10.3.2.2
Making new ep fs=0xc500,0x78b
doing opt -noresvport -noresvmnt -maproot=0:0 10.3.2.2
doing opt -noresvmnt -maproot=0:0 10.3.2.2
doing opt -maproot=0:0 10.3.2.2
got host 10.3.2.2
Got line /myexport -ro -noresvport -noresvmnt -maproot=0:0 10.4.2.2
Found ep fs=0xc500,0x78b
doing opt -ro -noresvport -noresvmnt -maproot=0:0 10.4.2.2
doing opt -noresvport -noresvmnt -maproot=0:0 10.4.2.2
doing opt -noresvmnt -maproot=0:0 10.4.2.2
doing opt -maproot=0:0 10.4.2.2
got host 10.4.2.2
Got line 
Got line /myexport -noresvport -noresvmnt -maproot=0:0 10.3.2.2
Making new ep fs=0xc500,0x78b
doing opt -noresvport -noresvmnt -maproot=0:0 10.3.2.2
doing opt -noresvmnt -maproot=0:0 10.3.2.2
doing opt -maproot=0:0 10.3.2.2
got host 10.3.2.2
Got line /myexport -ro -noresvport -noresvmnt -maproot=0:0 10.4.2.2
Found ep fs=0xc500,0x78b
doing opt -ro -noresvport -noresvmnt -maproot=0:0 10.4.2.2
doing opt -noresvport -noresvmnt -maproot=0:0 10.4.2.2
doing opt -noresvmnt -maproot=0:0 10.4.2.2
doing opt -maproot=0:0 10.4.2.2
got host 10.4.2.2
Got line 
Got line /myexport -noresvport -noresvmnt -maproot=0:0 10.3.2.2
Making new ep fs=0xc500,0x78b
doing opt -noresvport -noresvmnt -maproot=0:0 10.3.2.2
doing opt -noresvmnt -maproot=0:0 10.3.2.2
doing opt -maproot=0:0 10.3.2.2
got host 10.3.2.2
Got line /myexport -ro -noresvport -noresvmnt -maproot=0:0 10.4.2.2
Found ep fs=0xc500,0x78b
doing opt -ro -noresvport -noresvmnt -maproot=0:0 10.4.2.2
doing opt -noresvport -noresvmnt -maproot=0:0 10.4.2.2
doing opt -noresvmnt -maproot=0:0 10.4.2.2
doing opt -maproot=0:0 10.4.2.2
got host 10.4.2.2
Got line 
Got line /myexport -noresvport -noresvmnt -maproot=0:0 10.3.2.2
Making new ep fs=0xc500,0x78b
doing opt -noresvport -noresvmnt -maproot=0:0 10.3.2.2
doing opt -noresvmnt -maproot=0:0 10.3.2.2
doing opt -maproot=0:0 10.3.2.2
got host 10.3.2.2
Got line /myexport -ro -noresvport -noresvmnt -maproot=0:0 10.4.2.2
Found ep fs=0xc500,0x78b
doing opt -ro -noresvport -noresvmnt -maproot=0:0 10.4.2.2
doing opt -noresvport -noresvmnt -maproot=0:0 10.4.2.2
doing opt -noresvmnt -maproot=0:0 10.4.2.2
doing opt -maproot=0:0 10.4.2.2
got host 10.4.2.2
Got line 
Got line /myexport -noresvport -noresvmnt -maproot=0:0 10.3.2.2
Making new ep fs=0xc500,0x78b
doing opt -noresvport -noresvmnt -maproot=0:0 10.3.2.2
doing opt -noresvmnt -maproot=0:0 10.3.2.2
doing opt -maproot=0:0 10.3.2.2
got host 10.3.2.2
Got line /myexport -ro -noresvport -noresvmnt -maproot=0:0 10.4.2.2
Found ep fs=0xc500,0x78b
doing opt -ro -noresvport -noresvmnt -maproot=0:0 10.4.2.2
doing opt -noresvport -noresvmnt -maproot=0:0 10.4.2.2
doing opt -noresvmnt -maproot=0:0 10.4.2.2
doing opt -maproot=0:0 10.4.2.2
got host 10.4.2.2
Got line 
Got line /myexport -noresvport -noresvmnt -maproot=0:0 10.3.2.2
Making new ep fs=0xc500,0x78b
doing opt -noresvport -noresvmnt -maproot=0:0 10.3.2.2
doing opt -noresvmnt -maproot=0:0 10.3.2.2
doing opt -maproot=0:0 10.3.2.2
got host 10.3.2.2
Got line /myexport -ro -noresvport -noresvmnt -maproot=0:0 10.4.2.2
Found ep fs=0xc500,0x78b
doing opt -ro -noresvport -noresvmnt -maproot=0:0 10.4.2.2
doing opt -noresvport -noresvmnt -maproot=0:0 10.4.2.2
doing opt -noresvmnt -maproot=0:0 10.4.2.2
doing opt -maproot=0:0 10.4.2.2
got host 10.4.2.2
Got line 
Got line /myexport -noresvport -noresvmnt -maproot=0:0 10.3.2.2
Making new ep fs=0xc500,0x78b
doing opt -noresvport -noresvmnt -maproot=0:0 10.3.2.2
doing opt -noresvmnt -maproot=0:0 10.3.2.2
doing opt -maproot=0:0 10.3.2.2
got host 10.3.2.2
Got line /myexport -ro -noresvport -noresvmnt -maproot=0:0 10.4.2.2
Found ep fs=0xc500,0x78b
doing opt -ro -noresvport -noresvmnt -maproot=0:0 10.4.2.2
doing opt -noresvport -noresvmnt -maproot=0:0 10.4.2.2
doing opt -noresvmnt -maproot=0:0 10.4.2.2
doing opt -maproot=0:0 10.4.2.2
got host 10.4.2.2
Got line 
Got line /myexport -noresvport -noresvmnt -maproot=0:0 10.3.2.2
Making new ep fs=0xc500,0x78b
doing opt -noresvport -noresvmnt -maproot=0:0 10.3.2.2
doing opt -noresvmnt -maproot=0:0 10.3.2.2
doing opt -maproot=0:0 10.3.2.2
got host 10.3.2.2
Got line /myexport -ro -noresvport -noresvmnt -maproot=0:0 10.4.2.2
Found ep fs=0xc500,0x78b
doing opt -ro -noresvport -noresvmnt -maproot=0:0 10.4.2.2
doing opt -noresvport -noresvmnt -maproot=0:0 10.4.2.2
doing opt -noresvmnt -maproot=0:0 10.4.2.2
doing opt -maproot=0:0 10.4.2.2
got host 10.4.2.2
Got line 
Got line /myexport -noresvport -noresvmnt -maproot=0:0 10.3.2.2
Making new ep fs=0xc500,0x78b
doing opt -noresvport -noresvmnt -maproot=0:0 10.3.2.2
doing opt -noresvmnt -maproot=0:0 10.3.2.2
doing opt -maproot=0:0 10.3.2.2
got host 10.3.2.2
Got line /myexport -ro -noresvport -noresvmnt -maproot=0:0 10.4.2.2
Found ep fs=0xc500,0x78b
doing opt -ro -noresvport -noresvmnt -maproot=0:0 10.4.2.2
doing opt -noresvport -noresvmnt -maproot=0:0 10.4.2.2
doing opt -noresvmnt -maproot=0:0 10.4.2.2
doing opt -maproot=0:0 10.4.2.2
got host 10.4.2.2
Got line 
Got line /myexport -noresvport -noresvmnt -maproot=0:0 10.3.2.2
Making new ep fs=0xc500,0x78b
doing opt -noresvport -noresvmnt -maproot=0:0 10.3.2.2
doing opt -noresvmnt -maproot=0:0 10.3.2.2
doing opt -maproot=0:0 10.3.2.2
got host 10.3.2.2
Got line /myexport -ro -noresvport -noresvmnt -maproot=0:0 10.4.2.2
Found ep fs=0xc500,0x78b
doing opt -ro -noresvport -noresvmnt -maproot=0:0 10.4.2.2
doing opt -noresvport -noresvmnt -maproot=0:0 10.4.2.2
doing opt -noresvmnt -maproot=0:0 10.4.2.2
doing opt -maproot=0:0 10.4.2.2
got host 10.4.2.2
Got line 
Got line /myexport -noresvport -noresvmnt -maproot=0:0 10.3.2.2
Making new ep fs=0xc500,0x78b
doing opt -noresvport -noresvmnt -maproot=0:0 10.3.2.2
doing opt -noresvmnt -maproot=0:0 10.3.2.2
doing opt -maproot=0:0 10.3.2.2
got host 10.3.2.2
Got line /myexport -ro -noresvport -noresvmnt -maproot=0:0 10.4.2.2
Found ep fs=0xc500,0x78b
doing opt -ro -noresvport -noresvmnt -maproot=0:0 10.4.2.2
doing opt -noresvport -noresvmnt -maproot=0:0 10.4.2.2
doing opt -noresvmnt -maproot=0:0 10.4.2.2
doing opt -maproot=0:0 10.4.2.2
got host 10.4.2.2
Got line 
Got line /myexport -noresvport -noresvmnt -maproot=0:0 10.3.2.2
Making new ep fs=0xc500,0x78b
doing opt -noresvport -noresvmnt -maproot=0:0 10.3.2.2
doing opt -noresvmnt -maproot=0:0 10.3.2.2
doing opt -maproot=0:0 10.3.2.2
got host 10.3.2.2
Got line /myexport -ro -noresvport -noresvmnt -maproot=0:0 10.4.2.2
Found ep fs=0xc500,0x78b
doing opt -ro -noresvport -noresvmnt -maproot=0:0 10.4.2.2
doing opt -noresvport -noresvmnt -maproot=0:0 10.4.2.2
doing opt -noresvmnt -maproot=0:0 10.4.2.2
doing opt -maproot=0:0 10.4.2.2
got host 10.4.2.2
Got line 
Got line /myexport -noresvport -noresvmnt -maproot=0:0 10.3.2.2
Making new ep fs=0xc500,0x78b
doing opt -noresvport -noresvmnt -maproot=0:0 10.3.2.2
doing opt -noresvmnt -maproot=0:0 10.3.2.2
doing opt -maproot=0:0 10.3.2.2
got host 10.3.2.2
Got line /myexport -ro -noresvport -noresvmnt -maproot=0:0 10.4.2.2
Found ep fs=0xc500,0x78b
doing opt -ro -noresvport -noresvmnt -maproot=0:0 10.4.2.2
doing opt -noresvport -noresvmnt -maproot=0:0 10.4.2.2
doing opt -noresvmnt -maproot=0:0 10.4.2.2
doing opt -maproot=0:0 10.4.2.2
got host 10.4.2.2
Got line 
Got line /myexport -noresvport -noresvmnt -maproot=0:0 10.3.2.2
Making new ep fs=0xc500,0x78b
doing opt -noresvport -noresvmnt -maproot=0:0 10.3.2.2
doing opt -noresvmnt -maproot=0:0 10.3.2.2
doing opt -maproot=0:0 10.3.2.2
got host 10.3.2.2
Got line /myexport -ro -noresvport -noresvmnt -maproot=0:0 10.4.2.2
Found ep fs=0xc500,0x78b
doing opt -ro -noresvport -noresvmnt -maproot=0:0 10.4.2.2
doing opt -noresvport -noresvmnt -maproot=0:0 10.4.2.2
doing opt -noresvmnt -maproot=0:0 10.4.2.2
doing opt -maproot=0:0 10.4.2.2
got host 10.4.2.2
Got line 
Got line /myexport -noresvport -noresvmnt -maproot=0:0 10.3.2.2
Making new ep fs=0xc500,0x78b
doing opt -noresvport -noresvmnt -maproot=0:0 10.3.2.2
doing opt -noresvmnt -maproot=0:0 10.3.2.2
doing opt -maproot=0:0 10.3.2.2
got host 10.3.2.2
Got line /myexport -ro -noresvport -noresvmnt -maproot=0:0 10.4.2.2
Found ep fs=0xc500,0x78b
doing opt -ro -noresvport -noresvmnt -maproot=0:0 10.4.2.2
doing opt -noresvport -noresvmnt -maproot=0:0 10.4.2.2
doing opt -noresvmnt -maproot=0:0 10.4.2.2
doing opt -maproot=0:0 10.4.2.2
got host 10.4.2.2
Got line 
Got line /myexport -noresvport -noresvmnt -maproot=0:0 10.3.2.2
Making new ep fs=0xc500,0x78b
doing opt -noresvport -noresvmnt -maproot=0:0 10.3.2.2
doing opt -noresvmnt -maproot=0:0 10.3.2.2
doing opt -maproot=0:0 10.3.2.2
got host 10.3.2.2
Got line /myexport -ro -noresvport -noresvmnt -maproot=0:0 10.4.2.2
Found ep fs=0xc500,0x78b
doing opt -ro -noresvport -noresvmnt -maproot=0:0 10.4.2.2
doing opt -noresvport -noresvmnt -maproot=0:0 10.4.2.2
doing opt -noresvmnt -maproot=0:0 10.4.2.2
doing opt -maproot=0:0 10.4.2.2
got host 10.4.2.2
Got line 
Got line /myexport -noresvport -noresvmnt -maproot=0:0 10.3.2.2
Making new ep fs=0xc500,0x78b
doing opt -noresvport -noresvmnt -maproot=0:0 10.3.2.2
doing opt -noresvmnt -maproot=0:0 10.3.2.2
doing opt -maproot=0:0 10.3.2.2
got host 10.3.2.2
Got line /myexport -ro -noresvport -noresvmnt -maproot=0:0 10.4.2.2
Found ep fs=0xc500,0x78b
doing opt -ro -noresvport -noresvmnt -maproot=0:0 10.4.2.2
doing opt -noresvport -noresvmnt -maproot=0:0 10.4.2.2
doing opt -noresvmnt -maproot=0:0 10.4.2.2
doing opt -maproot=0:0 10.4.2.2
got host 10.4.2.2
Got line 
Got line /myexport -noresvport -noresvmnt -maproot=0:0 10.3.2.2
Making new ep fs=0xc500,0x78b
doing opt -noresvport -noresvmnt -maproot=0:0 10.3.2.2
doing opt -noresvmnt -maproot=0:0 10.3.2.2
doing opt -maproot=0:0 10.3.2.2
got host 10.3.2.2
Got line /myexport -ro -noresvport -noresvmnt -maproot=0:0 10.4.2.2
Found ep fs=0xc500,0x78b
doing opt -ro -noresvport -noresvmnt -maproot=0:0 10.4.2.2
doing opt -noresvport -noresvmnt -maproot=0:0 10.4.2.2
doing opt -noresvmnt -maproot=0:0 10.4.2.2
doing opt -maproot=0:0 10.4.2.2
got host 10.4.2.2
Got line 
Got line /myexport -noresvport -noresvmnt -maproot=0:0 10.3.2.2
Making new ep fs=0xc500,0x78b
doing opt -noresvport -noresvmnt -maproot=0:0 10.3.2.2
doing opt -noresvmnt -maproot=0:0 10.3.2.2
doing opt -maproot=0:0 10.3.2.2
got host 10.3.2.2
Got line /myexport -ro -noresvport -noresvmnt -maproot=0:0 10.4.2.2
Found ep fs=0xc500,0x78b
doing opt -ro -noresvport -noresvmnt -maproot=0:0 10.4.2.2
doing opt -noresvport -noresvmnt -maproot=0:0 10.4.2.2
doing opt -noresvmnt -maproot=0:0 10.4.2.2
doing opt -maproot=0:0 10.4.2.2
got host 10.4.2.2
Got line 
Got line /myexport -noresvport -noresvmnt -maproot=0:0 10.3.2.2
Making new ep fs=0xc500,0x78b
doing opt -noresvport -noresvmnt -maproot=0:0 10.3.2.2
doing opt -noresvmnt -maproot=0:0 10.3.2.2
doing opt -maproot=0:0 10.3.2.2
got host 10.3.2.2
Got line /myexport -ro -noresvport -noresvmnt -maproot=0:0 10.4.2.2
Found ep fs=0xc500,0x78b
doing opt -ro -noresvport -noresvmnt -maproot=0:0 10.4.2.2
doing opt -noresvport -noresvmnt -maproot=0:0 10.4.2.2
doing opt -noresvmnt -maproot=0:0 10.4.2.2
doing opt -maproot=0:0 10.4.2.2
got host 10.4.2.2
Got line 
Got line /myexport -noresvport -noresvmnt -maproot=0:0 10.3.2.2
Making new ep fs=0xc500,0x78b
doing opt -noresvport -noresvmnt -maproot=0:0 10.3.2.2
doing opt -noresvmnt -maproot=0:0 10.3.2.2
doing opt -maproot=0:0 10.3.2.2
got host 10.3.2.2
Got line /myexport -ro -noresvport -noresvmnt -maproot=0:0 10.4.2.2
Found ep fs=0xc500,0x78b
doing opt -ro -noresvport -noresvmnt -maproot=0:0 10.4.2.2
doing opt -noresvport -noresvmnt -maproot=0:0 10.4.2.2
doing opt -noresvmnt -maproot=0:0 10.4.2.2
doing opt -maproot=0:0 10.4.2.2
got host 10.4.2.2
Got line 
Got line /myexport -noresvport -noresvmnt -maproot=0:0 10.3.2.2
Making new ep fs=0xc500,0x78b
doing opt -noresvport -noresvmnt -maproot=0:0 10.3.2.2
doing opt -noresvmnt -maproot=0:0 10.3.2.2
doing opt -maproot=0:0 10.3.2.2
got host 10.3.2.2
Got line /myexport -ro -noresvport -noresvmnt -maproot=0:0 10.4.2.2
Found ep fs=0xc500,0x78b
doing opt -ro -noresvport -noresvmnt -maproot=0:0 10.4.2.2
doing opt -noresvport -noresvmnt -maproot=0:0 10.4.2.2
doing opt -noresvmnt -maproot=0:0 10.4.2.2
doing opt -maproot=0:0 10.4.2.2
got host 10.4.2.2
Got line 
Got line /myexport -noresvport -noresvmnt -maproot=0:0 10.3.2.2
Making new ep fs=0xc500,0x78b
doing opt -noresvport -noresvmnt -maproot=0:0 10.3.2.2
doing opt -noresvmnt -maproot=0:0 10.3.2.2
doing opt -maproot=0:0 10.3.2.2
got host 10.3.2.2
Got line /myexport -ro -noresvport -noresvmnt -maproot=0:0 10.4.2.2
Found ep fs=0xc500,0x78b
doing opt -ro -noresvport -noresvmnt -maproot=0:0 10.4.2.2
doing opt -noresvport -noresvmnt -maproot=0:0 10.4.2.2
doing opt -noresvmnt -maproot=0:0 10.4.2.2
doing opt -maproot=0:0 10.4.2.2
got host 10.4.2.2
Got line 
Got line /myexport -noresvport -noresvmnt -maproot=0:0 10.3.2.2
Making new ep fs=0xc500,0x78b
doing opt -noresvport -noresvmnt -maproot=0:0 10.3.2.2
doing opt -noresvmnt -maproot=0:0 10.3.2.2
doing opt -maproot=0:0 10.3.2.2
got host 10.3.2.2
Got line /myexport -ro -noresvport -noresvmnt -maproot=0:0 10.4.2.2
Found ep fs=0xc500,0x78b
doing opt -ro -noresvport -noresvmnt -maproot=0:0 10.4.2.2
doing opt -noresvport -noresvmnt -maproot=0:0 10.4.2.2
doing opt -noresvmnt -maproot=0:0 10.4.2.2
doing opt -maproot=0:0 10.4.2.2
got host 10.4.2.2
Got line 
Got line /myexport -noresvport -noresvmnt -maproot=0:0 10.3.2.2
Making new ep fs=0xc500,0x78b
doing opt -noresvport -noresvmnt -maproot=0:0 10.3.2.2
doing opt -noresvmnt -maproot=0:0 10.3.2.2
doing opt -maproot=0:0 10.3.2.2
got host 10.3.2.2
Got line /myexport -ro -noresvport -noresvmnt -maproot=0:0 10.4.2.2
Found ep fs=0xc500,0x78b
doing opt -ro -noresvport -noresvmnt -maproot=0:0 10.4.2.2
doing opt -noresvport -noresvmnt -maproot=0:0 10.4.2.2
doing opt -noresvmnt -maproot=0:0 10.4.2.2
doing opt -maproot=0:0 10.4.2.2
got host 10.4.2.2
Got line 
Got line /myexport -noresvport -noresvmnt -maproot=0:0 10.3.2.2
Making new ep fs=0xc500,0x78b
doing opt -noresvport -noresvmnt -maproot=0:0 10.3.2.2
doing opt -noresvmnt -maproot=0:0 10.3.2.2
doing opt -maproot=0:0 10.3.2.2
got host 10.3.2.2
Got line /myexport -ro -noresvport -noresvmnt -maproot=0:0 10.4.2.2
Found ep fs=0xc500,0x78b
doing opt -ro -noresvport -noresvmnt -maproot=0:0 10.4.2.2
doing opt -noresvport -noresvmnt -maproot=0:0 10.4.2.2
doing opt -noresvmnt -maproot=0:0 10.4.2.2
doing opt -maproot=0:0 10.4.2.2
got host 10.4.2.2
Got line 
Got line /myexport -noresvport -noresvmnt -maproot=0:0 10.3.2.2
Making new ep fs=0xc500,0x78b
doing opt -noresvport -noresvmnt -maproot=0:0 10.3.2.2
doing opt -noresvmnt -maproot=0:0 10.3.2.2
doing opt -maproot=0:0 10.3.2.2
got host 10.3.2.2
Got line /myexport -ro -noresvport -noresvmnt -maproot=0:0 10.4.2.2
Found ep fs=0xc500,0x78b
doing opt -ro -noresvport -noresvmnt -maproot=0:0 10.4.2.2
doing opt -noresvport -noresvmnt -maproot=0:0 10.4.2.2
doing opt -noresvmnt -maproot=0:0 10.4.2.2
doing opt -maproot=0:0 10.4.2.2
got host 10.4.2.2
Got line 
Got line /myexport -noresvport -noresvmnt -maproot=0:0 10.3.2.2
Making new ep fs=0xc500,0x78b
doing opt -noresvport -noresvmnt -maproot=0:0 10.3.2.2
doing opt -noresvmnt -maproot=0:0 10.3.2.2
doing opt -maproot=0:0 10.3.2.2
got host 10.3.2.2
Got line /myexport -ro -noresvport -noresvmnt -maproot=0:0 10.4.2.2
Found ep fs=0xc500,0x78b
doing opt -ro -noresvport -noresvmnt -maproot=0:0 10.4.2.2
doing opt -noresvport -noresvmnt -maproot=0:0 10.4.2.2
doing opt -noresvmnt -maproot=0:0 10.4.2.2
doing opt -maproot=0:0 10.4.2.2
got host 10.4.2.2
Got line 
Got line /myexport -noresvport -noresvmnt -maproot=0:0 10.3.2.2
Making new ep fs=0xc500,0x78b
doing opt -noresvport -noresvmnt -maproot=0:0 10.3.2.2
doing opt -noresvmnt -maproot=0:0 10.3.2.2
doing opt -maproot=0:0 10.3.2.2
got host 10.3.2.2
Got line /myexport -ro -noresvport -noresvmnt -maproot=0:0 10.4.2.2
Found ep fs=0xc500,0x78b
doing opt -ro -noresvport -noresvmnt -maproot=0:0 10.4.2.2
doing opt -noresvport -noresvmnt -maproot=0:0 10.4.2.2
doing opt -noresvmnt -maproot=0:0 10.4.2.2
doing opt -maproot=0:0 10.4.2.2
got host 10.4.2.2
Got line 
Got line /myexport -noresvport -noresvmnt -maproot=0:0 10.3.2.2
Making new ep fs=0xc500,0x78b
doing opt -noresvport -noresvmnt -maproot=0:0 10.3.2.2
doing opt -noresvmnt -maproot=0:0 10.3.2.2
doing opt -maproot=0:0 10.3.2.2
got host 10.3.2.2
Got line /myexport -ro -noresvport -noresvmnt -maproot=0:0 10.4.2.2
Found ep fs=0xc500,0x78b
doing opt -ro -noresvport -noresvmnt -maproot=0:0 10.4.2.2
doing opt -noresvport -noresvmnt -maproot=0:0 10.4.2.2
doing opt -noresvmnt -maproot=0:0 10.4.2.2
doing opt -maproot=0:0 10.4.2.2
got host 10.4.2.2
Got line 
Got line /myexport -noresvport -noresvmnt -maproot=0:0 10.3.2.2
Making new ep fs=0xc500,0x78b
doing opt -noresvport -noresvmnt -maproot=0:0 10.3.2.2
doing opt -noresvmnt -maproot=0:0 10.3.2.2
doing opt -maproot=0:0 10.3.2.2
got host 10.3.2.2
Got line /myexport -ro -noresvport -noresvmnt -maproot=0:0 10.4.2.2
Found ep fs=0xc500,0x78b
doing opt -ro -noresvport -noresvmnt -maproot=0:0 10.4.2.2
doing opt -noresvport -noresvmnt -maproot=0:0 10.4.2.2
doing opt -noresvmnt -maproot=0:0 10.4.2.2
doing opt -maproot=0:0 10.4.2.2
got host 10.4.2.2
Got line 
Got line /myexport -noresvport -noresvmnt -maproot=0:0 10.3.2.2
Making new ep fs=0xc500,0x78b
doing opt -noresvport -noresvmnt -maproot=0:0 10.3.2.2
doing opt -noresvmnt -maproot=0:0 10.3.2.2
doing opt -maproot=0:0 10.3.2.2
got host 10.3.2.2
Got line /myexport -ro -noresvport -noresvmnt -maproot=0:0 10.4.2.2
Found ep fs=0xc500,0x78b
doing opt -ro -noresvport -noresvmnt -maproot=0:0 10.4.2.2
doing opt -noresvport -noresvmnt -maproot=0:0 10.4.2.2
doing opt -noresvmnt -maproot=0:0 10.4.2.2
doing opt -maproot=0:0 10.4.2.2
got host 10.4.2.2
Got line 
Got line /myexport -noresvport -noresvmnt -maproot=0:0 10.3.2.2
Making new ep fs=0xc500,0x78b
doing opt -noresvport -noresvmnt -maproot=0:0 10.3.2.2
doing opt -noresvmnt -maproot=0:0 10.3.2.2
doing opt -maproot=0:0 10.3.2.2
got host 10.3.2.2
Got line /myexport -ro -noresvport -noresvmnt -maproot=0:0 10.4.2.2
Found ep fs=0xc500,0x78b
doing opt -ro -noresvport -noresvmnt -maproot=0:0 10.4.2.2
doing opt -noresvport -noresvmnt -maproot=0:0 10.4.2.2
doing opt -noresvmnt -maproot=0:0 10.4.2.2
doing opt -maproot=0:0 10.4.2.2
got host 10.4.2.2
Got line 
Got line /myexport -noresvport -noresvmnt -maproot=0:0 10.3.2.2
Making new ep fs=0xc500,0x78b
doing opt -noresvport -noresvmnt -maproot=0:0 10.3.2.2
doing opt -noresvmnt -maproot=0:0 10.3.2.2
doing opt -maproot=0:0 10.3.2.2
got host 10.3.2.2
Got line /myexport -ro -noresvport -noresvmnt -maproot=0:0 10.4.2.2
Found ep fs=0xc500,0x78b
doing opt -ro -noresvport -noresvmnt -maproot=0:0 10.4.2.2
doing opt -noresvport -noresvmnt -maproot=0:0 10.4.2.2
doing opt -noresvmnt -maproot=0:0 10.4.2.2
doing opt -maproot=0:0 10.4.2.2
got host 10.4.2.2
Got line 
Got line /myexport -noresvport -noresvmnt -maproot=0:0 10.3.2.2
Making new ep fs=0xc500,0x78b
doing opt -noresvport -noresvmnt -maproot=0:0 10.3.2.2
doing opt -noresvmnt -maproot=0:0 10.3.2.2
doing opt -maproot=0:0 10.3.2.2
got host 10.3.2.2
Got line /myexport -ro -noresvport -noresvmnt -maproot=0:0 10.4.2.2
Found ep fs=0xc500,0x78b
doing opt -ro -noresvport -noresvmnt -maproot=0:0 10.4.2.2
doing opt -noresvport -noresvmnt -maproot=0:0 10.4.2.2
doing opt -noresvmnt -maproot=0:0 10.4.2.2
doing opt -maproot=0:0 10.4.2.2
got host 10.4.2.2
Got line 
Got line /myexport -noresvport -noresvmnt -maproot=0:0 10.3.2.2
Making new ep fs=0xc500,0x78b
doing opt -noresvport -noresvmnt -maproot=0:0 10.3.2.2
doing opt -noresvmnt -maproot=0:0 10.3.2.2
doing opt -maproot=0:0 10.3.2.2
got host 10.3.2.2
Got line /myexport -ro -noresvport -noresvmnt -maproot=0:0 10.4.2.2
Found ep fs=0xc500,0x78b
doing opt -ro -noresvport -noresvmnt -maproot=0:0 10.4.2.2
doing opt -noresvport -noresvmnt -maproot=0:0 10.4.2.2
doing opt -noresvmnt -maproot=0:0 10.4.2.2
doing opt -maproot=0:0 10.4.2.2
got host 10.4.2.2
Got line 
Got line /myexport -noresvport -noresvmnt -maproot=0:0 10.3.2.2
Making new ep fs=0xc500,0x78b
doing opt -noresvport -noresvmnt -maproot=0:0 10.3.2.2
doing opt -noresvmnt -maproot=0:0 10.3.2.2
doing opt -maproot=0:0 10.3.2.2
got host 10.3.2.2
Got line /myexport -ro -noresvport -noresvmnt -maproot=0:0 10.4.2.2
Found ep fs=0xc500,0x78b
doing opt -ro -noresvport -noresvmnt -maproot=0:0 10.4.2.2
doing opt -noresvport -noresvmnt -maproot=0:0 10.4.2.2
doing opt -noresvmnt -maproot=0:0 10.4.2.2
doing opt -maproot=0:0 10.4.2.2
got host 10.4.2.2
Got line 
Got line /myexport -noresvport -noresvmnt -maproot=0:0 10.3.2.2
Making new ep fs=0xc500,0x78b
doing opt -noresvport -noresvmnt -maproot=0:0 10.3.2.2
doing opt -noresvmnt -maproot=0:0 10.3.2.2
doing opt -maproot=0:0 10.3.2.2
got host 10.3.2.2
Got line /myexport -ro -noresvport -noresvmnt -maproot=0:0 10.4.2.2
Found ep fs=0xc500,0x78b
doing opt -ro -noresvport -noresvmnt -maproot=0:0 10.4.2.2
doing opt -noresvport -noresvmnt -maproot=0:0 10.4.2.2
doing opt -noresvmnt -maproot=0:0 10.4.2.2
doing opt -maproot=0:0 10.4.2.2
got host 10.4.2.2
Got line 
Got line /myexport -noresvport -noresvmnt -maproot=0:0 10.3.2.2
Making new ep fs=0xc500,0x78b
doing opt -noresvport -noresvmnt -maproot=0:0 10.3.2.2
doing opt -noresvmnt -maproot=0:0 10.3.2.2
doing opt -maproot=0:0 10.3.2.2
got host 10.3.2.2
Got line /myexport -ro -noresvport -noresvmnt -maproot=0:0 10.4.2.2
Found ep fs=0xc500,0x78b
doing opt -ro -noresvport -noresvmnt -maproot=0:0 10.4.2.2
doing opt -noresvport -noresvmnt -maproot=0:0 10.4.2.2
doing opt -noresvmnt -maproot=0:0 10.4.2.2
doing opt -maproot=0:0 10.4.2.2
got host 10.4.2.2
Got line 
Got line /myexport -noresvport -noresvmnt -maproot=0:0 10.3.2.2
Making new ep fs=0xc500,0x78b
doing opt -noresvport -noresvmnt -maproot=0:0 10.3.2.2
doing opt -noresvmnt -maproot=0:0 10.3.2.2
doing opt -maproot=0:0 10.3.2.2
got host 10.3.2.2
Got line /myexport -ro -noresvport -noresvmnt -maproot=0:0 10.4.2.2
Found ep fs=0xc500,0x78b
doing opt -ro -noresvport -noresvmnt -maproot=0:0 10.4.2.2
doing opt -noresvport -noresvmnt -maproot=0:0 10.4.2.2
doing opt -noresvmnt -maproot=0:0 10.4.2.2
doing opt -maproot=0:0 10.4.2.2
got host 10.4.2.2
Got line 
Got line /myexport -noresvport -noresvmnt -maproot=0:0 10.3.2.2
Making new ep fs=0xc500,0x78b
doing opt -noresvport -noresvmnt -maproot=0:0 10.3.2.2
doing opt -noresvmnt -maproot=0:0 10.3.2.2
doing opt -maproot=0:0 10.3.2.2
got host 10.3.2.2
Got line /myexport -ro -noresvport -noresvmnt -maproot=0:0 10.4.2.2
Found ep fs=0xc500,0x78b
doing opt -ro -noresvport -noresvmnt -maproot=0:0 10.4.2.2
doing opt -noresvport -noresvmnt -maproot=0:0 10.4.2.2
doing opt -noresvmnt -maproot=0:0 10.4.2.2
doing opt -maproot=0:0 10.4.2.2
got host 10.4.2.2
Got line 
Got line /myexport -noresvport -noresvmnt -maproot=0:0 10.3.2.2
Making new ep fs=0xc500,0x78b
doing opt -noresvport -noresvmnt -maproot=0:0 10.3.2.2
doing opt -noresvmnt -maproot=0:0 10.3.2.2
doing opt -maproot=0:0 10.3.2.2
got host 10.3.2.2
Got line /myexport -ro -noresvport -noresvmnt -maproot=0:0 10.4.2.2
Found ep fs=0xc500,0x78b
doing opt -ro -noresvport -noresvmnt -maproot=0:0 10.4.2.2
doing opt -noresvport -noresvmnt -maproot=0:0 10.4.2.2
doing opt -noresvmnt -maproot=0:0 10.4.2.2
doing opt -maproot=0:0 10.4.2.2
got host 10.4.2.2
Got line 
Got line /myexport -noresvport -noresvmnt -maproot=0:0 10.3.2.2
Making new ep fs=0xc500,0x78b
doing opt -noresvport -noresvmnt -maproot=0:0 10.3.2.2
doing opt -noresvmnt -maproot=0:0 10.3.2.2
doing opt -maproot=0:0 10.3.2.2
got host 10.3.2.2
Got line /myexport -ro -noresvport -noresvmnt -maproot=0:0 10.4.2.2
Found ep fs=0xc500,0x78b
doing opt -ro -noresvport -noresvmnt -maproot=0:0 10.4.2.2
doing opt -noresvport -noresvmnt -maproot=0:0 10.4.2.2
doing opt -noresvmnt -maproot=0:0 10.4.2.2
doing opt -maproot=0:0 10.4.2.2
got host 10.4.2.2
Got line 
Got line /myexport -noresvport -noresvmnt -maproot=0:0 10.3.2.2
Making new ep fs=0xc500,0x78b
doing opt -noresvport -noresvmnt -maproot=0:0 10.3.2.2
doing opt -noresvmnt -maproot=0:0 10.3.2.2
doing opt -maproot=0:0 10.3.2.2
got host 10.3.2.2
Got line /myexport -ro -noresvport -noresvmnt -maproot=0:0 10.4.2.2
Found ep fs=0xc500,0x78b
doing opt -ro -noresvport -noresvmnt -maproot=0:0 10.4.2.2
doing opt -noresvport -noresvmnt -maproot=0:0 10.4.2.2
doing opt -noresvmnt -maproot=0:0 10.4.2.2
doing opt -maproot=0:0 10.4.2.2
got host 10.4.2.2
Got line 
Got line /myexport -noresvport -noresvmnt -maproot=0:0 10.3.2.2
Making new ep fs=0xc500,0x78b
doing opt -noresvport -noresvmnt -maproot=0:0 10.3.2.2
doing opt -noresvmnt -maproot=0:0 10.3.2.2
doing opt -maproot=0:0 10.3.2.2
got host 10.3.2.2
Got line /myexport -ro -noresvport -noresvmnt -maproot=0:0 10.4.2.2
Found ep fs=0xc500,0x78b
doing opt -ro -noresvport -noresvmnt -maproot=0:0 10.4.2.2
doing opt -noresvport -noresvmnt -maproot=0:0 10.4.2.2
doing opt -noresvmnt -maproot=0:0 10.4.2.2
doing opt -maproot=0:0 10.4.2.2
got host 10.4.2.2
Got line 
Got line /myexport -noresvport -noresvmnt -maproot=0:0 10.3.2.2
Making new ep fs=0xc500,0x78b
doing opt -noresvport -noresvmnt -maproot=0:0 10.3.2.2
doing opt -noresvmnt -maproot=0:0 10.3.2.2
doing opt -maproot=0:0 10.3.2.2
got host 10.3.2.2
Got line /myexport -ro -noresvport -noresvmnt -maproot=0:0 10.4.2.2
Found ep fs=0xc500,0x78b
doing opt -ro -noresvport -noresvmnt -maproot=0:0 10.4.2.2
doing opt -noresvport -noresvmnt -maproot=0:0 10.4.2.2
doing opt -noresvmnt -maproot=0:0 10.4.2.2
doing opt -maproot=0:0 10.4.2.2
got host 10.4.2.2
Got line 
Got line /myexport -noresvport -noresvmnt -maproot=0:0 10.3.2.2
Making new ep fs=0xc500,0x78b
doing opt -noresvport -noresvmnt -maproot=0:0 10.3.2.2
doing opt -noresvmnt -maproot=0:0 10.3.2.2
doing opt -maproot=0:0 10.3.2.2
got host 10.3.2.2
Got line /myexport -ro -noresvport -noresvmnt -maproot=0:0 10.4.2.2
Found ep fs=0xc500,0x78b
doing opt -ro -noresvport -noresvmnt -maproot=0:0 10.4.2.2
doing opt -noresvport -noresvmnt -maproot=0:0 10.4.2.2
doing opt -noresvmnt -maproot=0:0 10.4.2.2
doing opt -maproot=0:0 10.4.2.2
got host 10.4.2.2
Got line 
Got line /myexport -noresvport -noresvmnt -maproot=0:0 10.3.2.2
Making new ep fs=0xc500,0x78b
doing opt -noresvport -noresvmnt -maproot=0:0 10.3.2.2
doing opt -noresvmnt -maproot=0:0 10.3.2.2
doing opt -maproot=0:0 10.3.2.2
got host 10.3.2.2
Got line /myexport -ro -noresvport -noresvmnt -maproot=0:0 10.4.2.2
Found ep fs=0xc500,0x78b
doing opt -ro -noresvport -noresvmnt -maproot=0:0 10.4.2.2
doing opt -noresvport -noresvmnt -maproot=0:0 10.4.2.2
doing opt -noresvmnt -maproot=0:0 10.4.2.2
doing opt -maproot=0:0 10.4.2.2
got host 10.4.2.2
Got line 
Got line /myexport -noresvport -noresvmnt -maproot=0:0 10.3.2.2
Making new ep fs=0xc500,0x78b
doing opt -noresvport -noresvmnt -maproot=0:0 10.3.2.2
doing opt -noresvmnt -maproot=0:0 10.3.2.2
doing opt -maproot=0:0 10.3.2.2
got host 10.3.2.2
Got line /myexport -ro -noresvport -noresvmnt -maproot=0:0 10.4.2.2
Found ep fs=0xc500,0x78b
doing opt -ro -noresvport -noresvmnt -maproot=0:0 10.4.2.2
doing opt -noresvport -noresvmnt -maproot=0:0 10.4.2.2
doing opt -noresvmnt -maproot=0:0 10.4.2.2
doing opt -maproot=0:0 10.4.2.2
got host 10.4.2.2
Got line 
Got line /myexport -noresvport -noresvmnt -maproot=0:0 10.3.2.2
Making new ep fs=0xc500,0x78b
doing opt -noresvport -noresvmnt -maproot=0:0 10.3.2.2
doing opt -noresvmnt -maproot=0:0 10.3.2.2
doing opt -maproot=0:0 10.3.2.2
got host 10.3.2.2
Got line /myexport -ro -noresvport -noresvmnt -maproot=0:0 10.4.2.2
Found ep fs=0xc500,0x78b
doing opt -ro -noresvport -noresvmnt -maproot=0:0 10.4.2.2
doing opt -noresvport -noresvmnt -maproot=0:0 10.4.2.2
doing opt -noresvmnt -maproot=0:0 10.4.2.2
doing opt -maproot=0:0 10.4.2.2
got host 10.4.2.2
Got line 
Got line /myexport -noresvport -noresvmnt -maproot=0:0 10.3.2.2
Making new ep fs=0xc500,0x78b
doing opt -noresvport -noresvmnt -maproot=0:0 10.3.2.2
doing opt -noresvmnt -maproot=0:0 10.3.2.2
doing opt -maproot=0:0 10.3.2.2
got host 10.3.2.2
Got line /myexport -ro -noresvport -noresvmnt -maproot=0:0 10.4.2.2
Found ep fs=0xc500,0x78b
doing opt -ro -noresvport -noresvmnt -maproot=0:0 10.4.2.2
doing opt -noresvport -noresvmnt -maproot=0:0 10.4.2.2
doing opt -noresvmnt -maproot=0:0 10.4.2.2
doing opt -maproot=0:0 10.4.2.2
got host 10.4.2.2
Got line 
Got line /myexport -noresvport -noresvmnt -maproot=0:0 10.3.2.2
Making new ep fs=0xc500,0x78b
doing opt -noresvport -noresvmnt -maproot=0:0 10.3.2.2
doing opt -noresvmnt -maproot=0:0 10.3.2.2
doing opt -maproot=0:0 10.3.2.2
got host 10.3.2.2
Got line /myexport -ro -noresvport -noresvmnt -maproot=0:0 10.4.2.2
Found ep fs=0xc500,0x78b
doing opt -ro -noresvport -noresvmnt -maproot=0:0 10.4.2.2
doing opt -noresvport -noresvmnt -maproot=0:0 10.4.2.2
doing opt -noresvmnt -maproot=0:0 10.4.2.2
doing opt -maproot=0:0 10.4.2.2
got host 10.4.2.2
Got line 
Got line /myexport -noresvport -noresvmnt -maproot=0:0 10.3.2.2
Making new ep fs=0xc500,0x78b
doing opt -noresvport -noresvmnt -maproot=0:0 10.3.2.2
doing opt -noresvmnt -maproot=0:0 10.3.2.2
doing opt -maproot=0:0 10.3.2.2
got host 10.3.2.2
Got line /myexport -ro -noresvport -noresvmnt -maproot=0:0 10.4.2.2
Found ep fs=0xc500,0x78b
doing opt -ro -noresvport -noresvmnt -maproot=0:0 10.4.2.2
doing opt -noresvport -noresvmnt -maproot=0:0 10.4.2.2
doing opt -noresvmnt -maproot=0:0 10.4.2.2
doing opt -maproot=0:0 10.4.2.2
got host 10.4.2.2
Got line 
Got line /myexport -noresvport -noresvmnt -maproot=0:0 10.3.2.2
Making new ep fs=0xc500,0x78b
doing opt -noresvport -noresvmnt -maproot=0:0 10.3.2.2
doing opt -noresvmnt -maproot=0:0 10.3.2.2
doing opt -maproot=0:0 10.3.2.2
got host 10.3.2.2
Got line /myexport -ro -noresvport -noresvmnt -maproot=0:0 10.4.2.2
Found ep fs=0xc500,0x78b
doing opt -ro -noresvport -noresvmnt -maproot=0:0 10.4.2.2
doing opt -noresvport -noresvmnt -maproot=0:0 10.4.2.2
doing opt -noresvmnt -maproot=0:0 10.4.2.2
doing opt -maproot=0:0 10.4.2.2
got host 10.4.2.2
Got line 
Got line /myexport -noresvport -noresvmnt -maproot=0:0 10.3.2.2
Making new ep fs=0xc500,0x78b
doing opt -noresvport -noresvmnt -maproot=0:0 10.3.2.2
doing opt -noresvmnt -maproot=0:0 10.3.2.2
doing opt -maproot=0:0 10.3.2.2
got host 10.3.2.2
Got line /myexport -ro -noresvport -noresvmnt -maproot=0:0 10.4.2.2
Found ep fs=0xc500,0x78b
doing opt -ro -noresvport -noresvmnt -maproot=0:0 10.4.2.2
doing opt -noresvport -noresvmnt -maproot=0:0 10.4.2.2
doing opt -noresvmnt -maproot=0:0 10.4.2.2
doing opt -maproot=0:0 10.4.2.2
got host 10.4.2.2
Got line 
Got line /myexport -noresvport -noresvmnt -maproot=0:0 10.3.2.2
Making new ep fs=0xc500,0x78b
doing opt -noresvport -noresvmnt -maproot=0:0 10.3.2.2
doing opt -noresvmnt -maproot=0:0 10.3.2.2
doing opt -maproot=0:0 10.3.2.2
got host 10.3.2.2
Got line /myexport -ro -noresvport -noresvmnt -maproot=0:0 10.4.2.2
Found ep fs=0xc500,0x78b
doing opt -ro -noresvport -noresvmnt -maproot=0:0 10.4.2.2
doing opt -noresvport -noresvmnt -maproot=0:0 10.4.2.2
doing opt -noresvmnt -maproot=0:0 10.4.2.2
doing opt -maproot=0:0 10.4.2.2
got host 10.4.2.2
Got line 
Got line /myexport -noresvport -noresvmnt -maproot=0:0 10.3.2.2
Making new ep fs=0xc500,0x78b
doing opt -noresvport -noresvmnt -maproot=0:0 10.3.2.2
doing opt -noresvmnt -maproot=0:0 10.3.2.2
doing opt -maproot=0:0 10.3.2.2
got host 10.3.2.2
Got line /myexport -ro -noresvport -noresvmnt -maproot=0:0 10.4.2.2
Found ep fs=0xc500,0x78b
doing opt -ro -noresvport -noresvmnt -maproot=0:0 10.4.2.2
doing opt -noresvport -noresvmnt -maproot=0:0 10.4.2.2
doing opt -noresvmnt -maproot=0:0 10.4.2.2
doing opt -maproot=0:0 10.4.2.2
got host 10.4.2.2
Got line 
Got line /myexport -noresvport -noresvmnt -maproot=0:0 10.3.2.2
Making new ep fs=0xc500,0x78b
doing opt -noresvport -noresvmnt -maproot=0:0 10.3.2.2
doing opt -noresvmnt -maproot=0:0 10.3.2.2
doing opt -maproot=0:0 10.3.2.2
got host 10.3.2.2
Got line /myexport -ro -noresvport -noresvmnt -maproot=0:0 10.4.2.2
Found ep fs=0xc500,0x78b
doing opt -ro -noresvport -noresvmnt -maproot=0:0 10.4.2.2
doing opt -noresvport -noresvmnt -maproot=0:0 10.4.2.2
doing opt -noresvmnt -maproot=0:0 10.4.2.2
doing opt -maproot=0:0 10.4.2.2
got host 10.4.2.2
Got line 
Got line /myexport -noresvport -noresvmnt -maproot=0:0 10.3.2.2
Making new ep fs=0xc500,0x78b
doing opt -noresvport -noresvmnt -maproot=0:0 10.3.2.2
doing opt -noresvmnt -maproot=0:0 10.3.2.2
doing opt -maproot=0:0 10.3.2.2
got host 10.3.2.2
Got line /myexport -ro -noresvport -noresvmnt -maproot=0:0 10.4.2.2
Found ep fs=0xc500,0x78b
doing opt -ro -noresvport -noresvmnt -maproot=0:0 10.4.2.2
doing opt -noresvport -noresvmnt -maproot=0:0 10.4.2.2
doing opt -noresvmnt -maproot=0:0 10.4.2.2
doing opt -maproot=0:0 10.4.2.2
got host 10.4.2.2

Test case: fs/vfs/t_full/p2k_ffs_fillfs

Duration: 1.924314 seconds

Termination reason

SKIPPED: fs does not support explicit block allocation (GOP_ALLOC)

Standard error stream

rump_ffs: "image.fs" is a non-resolved or relative path.
rump_ffs: using "/tmp/atf-run.00362b/image.fs" instead.
rump_ffs: "p2kffsfake" is a non-resolved or relative path.
rump_ffs: using "/tmp/atf-run.00362b/p2kffsfake" instead.

Test case: fs/vfs/t_full/puffs_fillfs

Duration: 0.840000 seconds

Termination reason

SKIPPED: fs does not support explicit block allocation (GOP_ALLOC)

Test case: fs/vfs/t_full/rumpfs_fillfs

Duration: 0.630000 seconds

Termination reason

SKIPPED: fs does not support explicit block allocation (GOP_ALLOC)

Test case: fs/vfs/t_renamerace/msdosfs_renamerace

Duration: 5.991061 seconds

Termination reason

XFAIL: PR kern/44661: unmount failed: Device busy

Standard error stream

==== dumping mountpoint at ``/mnt'' ====

vnodecovered = 0x208c3640 syncer = 0x0 data = 0x2721b110
fs_bshift 12 dev_bshift = 9
flag = 0x1000<MNT_LOCAL>
iflag = 0x80<IMNT_HAS_TRANS>
refcnt = 2 unmounting @ 0x208c7024 updating @ 0x208c7908
statvfs cache:
	bsize = 4096
	frsize = 4096
	iosize = 4096
	blocks = 1239
	bfree = 1239
	bavail = 1239
	bresvd = 0
	files = 512
	ffree = 0
	favail = 0
	fresvd = 0
	f_fsidx = { 0xc500, 0x764f }
	owner = 0
	namemax = 255
	flag = 0x0
	syncwrites = 2372
	asyncwrites = 0
	syncreads = 7309
	asyncreads = 0
	fstypename = msdos
	mntonname = /mnt
	mntfromname = /dev/device0.msdosfs
locked vnodes =
all vnodes = 0x208c34e0

== dumping vnodes ==

VM OBJECT at 0x208c34e0, refs 6
VNODE flags 0x1<ROOT>
mp 0x208c7000 numoutput 0 size 0x4000 writesize 0x4000
data 0x27228f00 writecount 0 holdcnt 0
tag VT_MSDOSFS(4) type VDIR(2) mount 0x208c7000 typedata 0x0
v_lock 0x208c3584
clean bufs:
dirty bufs:

==== done ====

Test case: fs/vfs/t_renamerace/msdosfs_renamerace_dirs

Duration: 8.468500 seconds

Termination reason

XFAIL: PR kern/43626

Standard error stream

Test program crashed; attempting to get stack trace
[New process 1]
[New process 20]
[New process 19]
[New process 18]
[New process 17]
[New process 16]
[New process 15]
[New process 14]
[New process 13]
[New process 12]
[New process 11]
[New process 10]
[New process 9]
[New process 8]
[New process 7]
[New process 6]
[New process 5]
[New process 4]
[New process 3]
[New process 2]
Core was generated by `t_renamerace'.
Program terminated with signal 6, Aborted.
#0  0x206df668 in abort () from /usr/lib/libc.so.12
#0  0x206df668 in abort () from /usr/lib/libc.so.12
#1  0x00014ed4 in renamerace_dirs.clone.0 ()
#2  0x00015de8 in atfu_msdosfs_renamerace_dirs_body ()
#3  0x0002a36c in atf_tc_run ()
#4  0x00028cc4 in atf_tp_main ()
#5  0x00013998 in ___start ()
#6  0x000137f8 in _start ()
Stack trace complete

Test case: fs/vfs/t_renamerace/rumpfs_renamerace

Duration: 0.780000 seconds

Termination reason

SKIPPED: rename not supported by file system

Test case: fs/vfs/t_renamerace/rumpfs_renamerace_dirs

Duration: 0.672370 seconds

Termination reason

SKIPPED: rename not supported by file system

Test case: fs/vfs/t_renamerace/sysvbfs_renamerace_dirs

Duration: 0.834060 seconds

Termination reason

SKIPPED: directories not supported by file system

Test case: fs/vfs/t_rmdirrace/sysvbfs_race

Duration: 0.726493 seconds

Termination reason

SKIPPED: directories not supported by file system

Test case: fs/vfs/t_union/ext2fs_basic

Duration: 0.944339 seconds

Termination reason

SKIPPED: fs does not support VOP_WHITEOUT

Test case: fs/vfs/t_union/ext2fs_whiteout

Duration: 1.190000 seconds

Termination reason

SKIPPED: fs does not support VOP_WHITEOUT

Test case: fs/vfs/t_union/msdosfs_basic

Duration: 0.905439 seconds

Termination reason

SKIPPED: fs does not support VOP_WHITEOUT

Test case: fs/vfs/t_union/msdosfs_whiteout

Duration: 1.160346 seconds

Termination reason

SKIPPED: fs does not support VOP_WHITEOUT

Test case: fs/vfs/t_union/nfs_basic

Duration: 2.160000 seconds

Termination reason

SKIPPED: fs does not support VOP_WHITEOUT

Standard error stream

rumpnfsd: Cannot get information for `udp6'
rumpnfsd: Cannot get information for `tcp6'
Getting export list.
Got line 
Got line /myexport -noresvport -noresvmnt -maproot=0:0 10.3.2.2
Making new ep fs=0xc500,0x78b
doing opt -noresvport -noresvmnt -maproot=0:0 10.3.2.2
doing opt -noresvmnt -maproot=0:0 10.3.2.2
doing opt -maproot=0:0 10.3.2.2
got host 10.3.2.2
Got line /myexport -ro -noresvport -noresvmnt -maproot=0:0 10.4.2.2
Found ep fs=0xc500,0x78b
doing opt -ro -noresvport -noresvmnt -maproot=0:0 10.4.2.2
doing opt -noresvport -noresvmnt -maproot=0:0 10.4.2.2
doing opt -noresvmnt -maproot=0:0 10.4.2.2
doing opt -maproot=0:0 10.4.2.2
got host 10.4.2.2
Getting mount list.
Here we go.
got mount request from 10.3.2.2
-> rpcpath: /myexport
-> dpath: /myexport
Mount successful.

Test case: fs/vfs/t_union/nfs_whiteout

Duration: 2.460400 seconds

Termination reason

SKIPPED: fs does not support VOP_WHITEOUT

Standard error stream

rumpnfsd: Cannot get information for `udp6'
rumpnfsd: Cannot get information for `tcp6'
Getting export list.
Got line 
Got line /myexport -noresvport -noresvmnt -maproot=0:0 10.3.2.2
Making new ep fs=0xc500,0x78b
doing opt -noresvport -noresvmnt -maproot=0:0 10.3.2.2
doing opt -noresvmnt -maproot=0:0 10.3.2.2
doing opt -maproot=0:0 10.3.2.2
got host 10.3.2.2
Got line /myexport -ro -noresvport -noresvmnt -maproot=0:0 10.4.2.2
Found ep fs=0xc500,0x78b
doing opt -ro -noresvport -noresvmnt -maproot=0:0 10.4.2.2
doing opt -noresvport -noresvmnt -maproot=0:0 10.4.2.2
doing opt -noresvmnt -maproot=0:0 10.4.2.2
doing opt -maproot=0:0 10.4.2.2
got host 10.4.2.2
Getting mount list.
Here we go.
got mount request from 10.3.2.2
-> rpcpath: /myexport
-> dpath: /myexport
Mount successful.

Test case: fs/vfs/t_union/p2k_ffs_basic

Duration: 1.398738 seconds

Termination reason

SKIPPED: fs does not support VOP_WHITEOUT

Standard error stream

rump_ffs: "image.fs" is a non-resolved or relative path.
rump_ffs: using "/tmp/atf-run.00362a/image.fs" instead.
rump_ffs: "p2kffsfake" is a non-resolved or relative path.
rump_ffs: using "/tmp/atf-run.00362a/p2kffsfake" instead.

Test case: fs/vfs/t_union/p2k_ffs_whiteout

Duration: 4.760000 seconds

Termination reason

SKIPPED: fs does not support VOP_WHITEOUT

Standard error stream

rump_ffs: "image.fs" is a non-resolved or relative path.
rump_ffs: using "/tmp/atf-run.00362b/image.fs" instead.
rump_ffs: "p2kffsfake" is a non-resolved or relative path.
rump_ffs: using "/tmp/atf-run.00362b/p2kffsfake" instead.

Test case: fs/vfs/t_union/puffs_basic

Duration: 0.860000 seconds

Termination reason

SKIPPED: fs does not support VOP_WHITEOUT

Test case: fs/vfs/t_union/puffs_whiteout

Duration: 1.070000 seconds

Termination reason

SKIPPED: fs does not support VOP_WHITEOUT

Test case: fs/vfs/t_union/sysvbfs_basic

Duration: 0.843442 seconds

Termination reason

SKIPPED: fs does not support VOP_WHITEOUT

Test case: fs/vfs/t_union/sysvbfs_whiteout

Duration: 1.051041 seconds

Termination reason

SKIPPED: fs does not support VOP_WHITEOUT

Test case: fs/vfs/t_union/v7fs_basic

Duration: 1.105523 seconds

Termination reason

SKIPPED: fs does not support VOP_WHITEOUT

Test case: fs/vfs/t_union/v7fs_whiteout

Duration: 1.390000 seconds

Termination reason

SKIPPED: fs does not support VOP_WHITEOUT

Test case: fs/vfs/t_unpriv/msdosfs_owner

Duration: 0.890564 seconds

Termination reason

SKIPPED: owner not supported by file system

Test case: fs/vfs/t_unpriv/nfs_flags

Duration: 3.290000 seconds

Termination reason

SKIPPED: file flags not supported by file system

Standard error stream

rumpnfsd: Cannot get information for `udp6'
rumpnfsd: Cannot get information for `tcp6'
Getting export list.
Got line 
Got line /myexport -noresvport -noresvmnt -maproot=0:0 10.3.2.2
Making new ep fs=0xc500,0x78b
doing opt -noresvport -noresvmnt -maproot=0:0 10.3.2.2
doing opt -noresvmnt -maproot=0:0 10.3.2.2
doing opt -maproot=0:0 10.3.2.2
got host 10.3.2.2
Got line /myexport -ro -noresvport -noresvmnt -maproot=0:0 10.4.2.2
Found ep fs=0xc500,0x78b
doing opt -ro -noresvport -noresvmnt -maproot=0:0 10.4.2.2
doing opt -noresvport -noresvmnt -maproot=0:0 10.4.2.2
doing opt -noresvmnt -maproot=0:0 10.4.2.2
doing opt -maproot=0:0 10.4.2.2
got host 10.4.2.2
Getting mount list.
Here we go.
t_unpriv: rpcbind to nfs on server: RPC: Program not registered
got mount request from 10.3.2.2
-> rpcpath: /myexport
-> dpath: /myexport
Mount successful.

Test case: fs/vfs/t_unpriv/puffs_flags

Duration: 0.750000 seconds

Termination reason

SKIPPED: file flags not supported by file system

Test case: fs/vfs/t_unpriv/sysvbfs_dirperms

Duration: 0.800000 seconds

Termination reason

SKIPPED: directories not supported by file system

Test case: fs/vfs/t_unpriv/sysvbfs_flags

Duration: 0.880118 seconds

Termination reason

SKIPPED: file flags not supported by file system

Test case: fs/vfs/t_vfsops/lfs_tfhremove

Duration: 2.931820 seconds

Termination reason

XFAIL: fhopen() for removed file succeeds (PR kern/43745): /tmp/bracket/build/2012.06.14.20.18.16-sparc/src/tests/fs/vfs/t_vfsops.c:152: Expected true value in rump_sys_fhopen(fhp, fhsize, O_RDONLY) == -1

Standard output stream

WARNING: the log-structured file system is experimental
WARNING: it may cause system crashes and/or corrupt data

Standard error stream

lfs_cleanerd[3675]: /mnt: attaching cleaner

Test case: fs/vfs/t_vfsops/rumpfs_tfhinval

Duration: 0.700000 seconds

Termination reason

SKIPPED: file handles not supported

Standard output stream

RNG seed 1340236497

Test case: fs/vfs/t_vfsops/rumpfs_tfhremove

Duration: 0.760000 seconds

Termination reason

SKIPPED: file handles not supported

Test case: fs/vfs/t_vfsops/rumpfs_tfilehandle

Duration: 0.670000 seconds

Termination reason

SKIPPED: file handles not supported

Test case: fs/vfs/t_vfsops/sysvbfs_tfhinval

Duration: 0.842572 seconds

Termination reason

SKIPPED: file handles not supported

Standard output stream

RNG seed 1340236501

Test case: fs/vfs/t_vfsops/sysvbfs_tfhremove

Duration: 0.829498 seconds

Termination reason

SKIPPED: file handles not supported

Test case: fs/vfs/t_vfsops/sysvbfs_tfilehandle

Duration: 0.909942 seconds

Termination reason

SKIPPED: file handles not supported

Test case: fs/vfs/t_vfsops/v7fs_tfhinval

Duration: 1.106424 seconds

Termination reason

SKIPPED: file handles not supported

Standard output stream

RNG seed 1340236511

Test case: fs/vfs/t_vfsops/v7fs_tfhremove

Duration: 1.130000 seconds

Termination reason

SKIPPED: file handles not supported

Test case: fs/vfs/t_vfsops/v7fs_tfilehandle

Duration: 1.130000 seconds

Termination reason

SKIPPED: file handles not supported

Duration: 1.020000 seconds

Termination reason

SKIPPED: symlinks not supported by file system

Duration: 1.050000 seconds

Termination reason

SKIPPED: symlinks not supported by file system

Test case: fs/vfs/t_vnops/rumpfs_rename_dir

Duration: 0.738390 seconds

Termination reason

SKIPPED: rename not supported by file system

Test case: fs/vfs/t_vnops/rumpfs_rename_dotdot

Duration: 0.720000 seconds

Termination reason

SKIPPED: rename not supported by file system

Test case: fs/vfs/t_vnops/rumpfs_rename_nametoolong

Duration: 0.730000 seconds

Termination reason

SKIPPED: rename not supported by file system

Test case: fs/vfs/t_vnops/rumpfs_rename_reg_nodir

Duration: 0.720000 seconds

Termination reason

SKIPPED: rename not supported by file system

Test case: fs/vfs/t_vnops/sysvbfs_dir_notempty

Duration: 0.944826 seconds

Termination reason

SKIPPED: directories not supported by file system

Test case: fs/vfs/t_vnops/sysvbfs_dir_rmdirdotdot

Duration: 0.990000 seconds

Termination reason

SKIPPED: directories not supported by file system

Test case: fs/vfs/t_vnops/sysvbfs_dir_simple

Duration: 0.948102 seconds

Termination reason

SKIPPED: directories not supported by file system

Test case: fs/vfs/t_vnops/sysvbfs_lookup_complex

Duration: 0.960000 seconds

Termination reason

SKIPPED: directories not supported by file system

Test case: fs/vfs/t_vnops/sysvbfs_rename_dir

Duration: 0.950000 seconds

Termination reason

SKIPPED: directories not supported by file system

Test case: fs/vfs/t_vnops/sysvbfs_rename_dotdot

Duration: 0.940000 seconds

Termination reason

SKIPPED: directories not supported by file system

Duration: 0.970000 seconds

Termination reason

SKIPPED: symlinks not supported by file system

Duration: 0.960000 seconds

Termination reason

SKIPPED: symlinks not supported by file system

Test case: games/t_factor/loop

Duration: 0.009666 seconds

Termination reason

SKIPPED: Required program '/usr/games/factor' not found in the PATH

Test case: games/t_factor/overflow

Duration: 0.007813 seconds

Termination reason

SKIPPED: Required program '/usr/games/factor' not found in the PATH

Test case: include/t_errno/errno_constants

Duration: 0.051909 seconds

Termination reason

XFAIL: PR standards/44921: 2 checks failed as expected; see output for more details

Standard error stream

*** Expected check failure: PR standards/44921: ENOTRECOVERABLE not defined
*** Expected check failure: PR standards/44921: EOWNERDEAD not defined

Test case: include/t_netdb/netdb_constants

Duration: 0.050000 seconds

Termination reason

XFAIL: PR standards/44777: 2 checks failed as expected; see output for more details

Standard error stream

*** Expected check failure: PR standards/44777: AI_V4MAPPED not defined
*** Expected check failure: PR standards/44777: AI_ALL not defined

Test case: include/t_paths/paths

Duration: 0.040000 seconds

Termination reason

SKIPPED: PR port-sparc/45580

Test case: ipf/t_filter_exec/f18

Duration: 0.390000 seconds

Termination reason

SKIPPED: This test case is probably broken

Test case: ipf/t_filter_parse/i17

Duration: 0.387477 seconds

Termination reason

SKIPPED: This test case is probably broken

Test case: ipf/t_logging/l1

Duration: 1.267072 seconds

Termination reason

FAILED: atf-check failed; see the output of the test for details

Standard output stream

Executing command [ /bin/sh -c echo log in all | ipftest -br - -F hex -i in -l logout ]
Executing command [ /bin/sh -c TZ=GMT ipmon -P /dev/null -f logout ]

Standard error stream

Fail: incorrect exit status: 138, expected: 0
stdout:
missed 1 ipf log entries: 0 1
01/01/1970 00:00:00.000000 anon0 @-1:-1 L 1.1.1.1,1025 -> 2.2.2.2,25 PR tcp len 20 40 -S IN

stderr:
[1]   Bus error (core dumped) TZ=GMT ipmon -P ...

Test case: ipf/t_nat_exec/n10

Duration: 0.260892 seconds

Termination reason

SKIPPED: This test case is probably broken

Test case: ipf/t_nat_exec/n12

Duration: 0.250000 seconds

Termination reason

SKIPPED: This test case is probably broken

Test case: ipf/t_nat_exec/n13

Duration: 0.250000 seconds

Termination reason

SKIPPED: This test case is probably broken

Test case: ipf/t_nat_exec/n14

Duration: 0.250000 seconds

Termination reason

SKIPPED: This test case is probably broken

Test case: ipf/t_nat_exec/n3

Duration: 0.370000 seconds

Termination reason

SKIPPED: This test case is probably broken

Test case: ipf/t_nat_exec/n7

Duration: 0.310000 seconds

Termination reason

SKIPPED: This test case is probably broken

Test case: ipf/t_nat_exec/n8

Duration: 0.250000 seconds

Termination reason

SKIPPED: This test case is probably broken

Test case: ipf/t_nat_exec/n9

Duration: 0.260000 seconds

Termination reason

SKIPPED: This test case is probably broken

Test case: ipf/t_nat_ipf_exec/ni1

Duration: 0.260000 seconds

Termination reason

SKIPPED: This test case is probably broken

Test case: ipf/t_nat_ipf_exec/ni13

Duration: 0.262584 seconds

Termination reason

SKIPPED: This test case is probably broken

Test case: ipf/t_nat_ipf_exec/ni14

Duration: 0.260000 seconds

Termination reason

SKIPPED: This test case is probably broken

Test case: ipf/t_nat_ipf_exec/ni15

Duration: 0.262880 seconds

Termination reason

SKIPPED: This test case is probably broken

Test case: ipf/t_nat_ipf_exec/ni16

Duration: 0.330646 seconds

Termination reason

SKIPPED: This test case is probably broken

Test case: ipf/t_nat_ipf_exec/ni2

Duration: 0.321009 seconds

Termination reason

SKIPPED: This test case is probably broken

Test case: ipf/t_nat_ipf_exec/ni3

Duration: 0.370000 seconds

Termination reason

SKIPPED: This test case is probably broken

Test case: ipf/t_nat_ipf_exec/ni4

Duration: 0.260000 seconds

Termination reason

SKIPPED: This test case is probably broken

Test case: ipf/t_nat_ipf_exec/ni6

Duration: 0.254567 seconds

Termination reason

SKIPPED: This test case is probably broken

Test case: ipf/t_nat_ipf_exec/ni7

Duration: 0.252278 seconds

Termination reason

SKIPPED: This test case is probably broken

Test case: ipf/t_nat_ipf_exec/ni8

Duration: 0.250815 seconds

Termination reason

SKIPPED: This test case is probably broken

Test case: ipf/t_nat_ipf_exec/ni9

Duration: 0.290000 seconds

Termination reason

SKIPPED: This test case is probably broken

Test case: lib/libc/regex/t_exhaust/regcomp_too_big

Duration: 0.015859 seconds

Termination reason

SKIPPED: Not enough memory; needed 125829120, available 32604160

Test case: lib/libc/stdlib/t_strtod/strtold_inf

Duration: 0.041742 seconds

Termination reason

SKIPPED: Requires long double support

Test case: lib/libc/stdlib/t_strtod/strtold_nan

Duration: 0.040000 seconds

Termination reason

SKIPPED: Requires long double support

Test case: lib/libc/string/t_popcount/popcount_basic

Duration: 0.031153 seconds

Termination reason

SKIPPED: config variable "run_popcount" not set to YES/TRUE

Test case: lib/libc/string/t_popcount/popcountll_basic

Duration: 0.031240 seconds

Termination reason

SKIPPED: config variable "run_popcount" not set to YES/TRUE

Test case: lib/libc/sys/t_getrusage/getrusage_utime_back

Duration: 17.162599 seconds

Termination reason

XFAIL: PR kern/30115: anticipated error did not occur

Test case: lib/libc/sys/t_getrusage/getrusage_utime_zero

Duration: 8.600000 seconds

Termination reason

XFAIL: PR kern/30115: anticipated error did not occur

Test case: lib/libc/sys/t_kevent/kqueue_desc_passing

Duration: 0.040851 seconds

Termination reason

SKIPPED: PR kern/46523

Standard output stream

parent (pid 15575): sending kq fd 3

Test case: lib/libc/sys/t_mincore/mincore_resid

Duration: 0.073159 seconds

Termination reason

SKIPPED: mlockall() exceeded process resource limits

Test case: lib/libc/sys/t_mmap/mmap_block

Duration: 0.037761 seconds

Termination reason

SKIPPED: The test case causes a panic (PR kern/38889, kern/46592)

Test case: lib/libc/sys/t_mprotect/mprotect_exec

Duration: 0.030000 seconds

Termination reason

SKIPPED: Execute protection callback check not implemented

Test case: lib/libc/sys/t_sigaction/sigaction_resethand

Duration: 0.070000 seconds

Termination reason

FAILED: Child process did not exit cleanly; it either failed to process the signal or SA_RESETHAND is broken; raw exit status was 139

Test case: lib/libexecinfo/t_backtrace/backtrace_fmt_basic

Duration: 0.040000 seconds

Termination reason

SKIPPED: PR toolchain/46490: libexecinfo only works on amd64 currently

Test case: lib/libm/t_pow/pow_one_neg_x

Duration: 0.050000 seconds

Termination reason

XFAIL: PR lib/45372: 2 checks failed as expected; see output for more details

Standard error stream

*** Expected check failure: PR lib/45372: pow(-1.0, +Inf) != 1.0
*** Expected check failure: PR lib/45372: pow(-1.0, -Inf) != 1.0

Test case: lib/libm/t_pow/pow_zero_x

Duration: 0.041219 seconds

Termination reason

XFAIL: PR port-amd64/45391: 3 checks failed as expected; see output for more details

Standard error stream

*** Expected check failure: PR port-amd64/45391: pow(+0.0, -4.0) != HUGE_VAL
*** Expected check failure: PR port-amd64/45391: pow(-0.0, -4.0) != HUGE_VAL
*** Expected check failure: PR port-amd64/45391: pow(+0.0, -5.0) != HUGE_VAL

Test case: lib/libm/t_pow/powf_one_neg_x

Duration: 0.040000 seconds

Termination reason

XFAIL: PR lib/45372: 2 checks failed as expected; see output for more details

Standard error stream

*** Expected check failure: PR lib/45372: powf(-1.0, +Inf) != 1.0
*** Expected check failure: PR lib/45372: powf(-1.0, -Inf) != 1.0

Test case: lib/libm/t_pow/powf_zero_x

Duration: 0.043900 seconds

Termination reason

XFAIL: PR port-amd64/45391: 3 checks failed as expected; see output for more details

Standard error stream

*** Expected check failure: PR port-amd64/45391: powf(+0.0, -4.0) != HUGE_VALF
*** Expected check failure: PR port-amd64/45391: powf(-0.0, -4.0) != HUGE_VALF
*** Expected check failure: PR port-amd64/45391: powf(+0.0, -5.0) != HUGE_VALF

Test case: lib/libm/t_scalbn/scalbnl_inf_neg

Duration: 0.040000 seconds

Termination reason

SKIPPED: Requires long double support

Test case: lib/libm/t_scalbn/scalbnl_inf_pos

Duration: 0.040000 seconds

Termination reason

SKIPPED: Requires long double support

Test case: lib/libm/t_scalbn/scalbnl_nan

Duration: 0.038356 seconds

Termination reason

SKIPPED: Requires long double support

Test case: lib/libm/t_scalbn/scalbnl_zero_neg

Duration: 0.040000 seconds

Termination reason

SKIPPED: Requires long double support

Test case: lib/libm/t_scalbn/scalbnl_zero_pos

Duration: 0.040000 seconds

Termination reason

SKIPPED: Requires long double support

Test case: lib/libpthread/t_cond/cond_timedwait_race

Duration: 1.624842 seconds

Termination reason

XFAIL: PR lib/44756: /tmp/bracket/build/2012.06.14.20.18.16-sparc/src/tests/lib/libpthread/t_cond.c:338: rv == ETIMEDOUT not met

Test case: lib/librumphijack/t_tcpip/nfs_autoload

Duration: 0.970000 seconds

Termination reason

SKIPPED: test currently valid only on i386

Test case: lib/libtre/t_exhaust/regcomp_too_big

Duration: 0.008861 seconds

Termination reason

SKIPPED: Not enough memory; needed 125829120, available 32604160

Test case: modules/t_modctl/cmd_load

Duration: 0.200000 seconds

Termination reason

FAILED: Module load failed

Standard output stream

Loading module  
Loading module non-existent.o
Loading module aaaaaaaaaaaaaaaaaaaaaaaaaaaaaaaaaaaaaaaaaaaaaaaaaaaaaaaaaaaaaaaaaaaaaaaaaaaaaaaaaaaaaaaaaaaaaaaaaaaaaaaaaaaaaaaaaaaaaaaaaaaaaaaaaaaaaaaaaaaaaaaaaaaaaaaaaaaaaaaaaaaaaaaaaaaaaaaaaaaaaaaaaaaaaaaaaaaaaaaaaaaaaaaaaaaaaaaaaaaaaaaaaaaaaaaaaaaaaaaaaaaaaaaaaaaaaaaaaaaaaaaaaaaaaaaaaaaaaaaaaaaaaaaaaaaaaaaaaaaaaaaaaaaaaaaaaaaaaaaaaaaaaaaaaaaaaaaaaaaaaaaaaaaaaaaaaaaaaaaaaaaaaaaaaaaaaaaaaaaaaaaaaaaaaaaaaaaaaaaaaaaaaaaaaaaaaaaaaaaaaaaaaaaaaaaaaaaaaaaaaaaaaaaaaaaaaaaaaaaaaaaaaaaaaaaaaaaaaaaaaaaaaaaaaaaaaaaaaaaaaaaaaaaaaaaaaaaaaaaaaaaaaaaaaaaaaaaaaaaaaaaaaaaaaaaaaaaaaaaaaaaaaaaaaaaaaaaaaaaaaaaaaaaaaaaaaaaaaaaaaaaaaaaaaaaaaaaaaaaaaaaaaaaaaaaaaaaaaaaaaaaaaaaaaaaaaaaaaaaaaaaaaaaaaaaaaaaaaaaaaaaaaaaaaaaaaaaaaaaaaaaaaaaaaaaaaaaaaaaaaaaaaaaaaaaaaaaaaaaaaaaaaaaaaaaaaaaaaaaaaaaaaaaaaaaaaaaaaaaaaaaaaaaaaaaaaaaaaaaaaaaaaaaaaaaaaaaaaaaaaaaaaaaaaaaaaaaaaaaaaaaaaaaaaaaaaaaaaaaaaaaaaaaaaaaaaaaaaaaaaaaaaaaaaaaaaaaaaaaaaaaaaaaaaaaaaaaaaaaaaaaaaaaaaaaaaaaaaaaaaaaaaaaaaaaaaaaaaaaaaaaaaaaaaaaaaaaaaaaaaaaaaaaaaaaaaaaaaaaaaaaaaaaaaaaaaaaaaaaaaaa
Loading module /usr/tests/modules/k_helper/k_helper.kmod

Standard error stream

modctl(MODCTL_LOAD,  ), failed: Operation not permitted
*** Check failed: /tmp/bracket/build/2012.06.14.20.18.16-sparc/src/tests/modules/t_modctl.c:297: load(NULL, false, " ") == ENOENT not met
modctl(MODCTL_LOAD, non-existent.o), failed: Operation not permitted
*** Check failed: /tmp/bracket/build/2012.06.14.20.18.16-sparc/src/tests/modules/t_modctl.c:298: load(NULL, false, "non-existent.o") == ENOENT not met
modctl(MODCTL_LOAD, aaaaaaaaaaaaaaaaaaaaaaaaaaaaaaaaaaaaaaaaaaaaaaaaaaaaaaaaaaaaaaaaaaaaaaaaaaaaaaaaaaaaaaaaaaaaaaaaaaaaaaaaaaaaaaaaaaaaaaaaaaaaaaaaaaaaaaaaaaaaaaaaaaaaaaaaaaaaaaaaaaaaaaaaaaaaaaaaaaaaaaaaaaaaaaaaaaaaaaaaaaaaaaaaaaaaaaaaaaaaaaaaaaaaaaaaaaaaaaaaaaaaaaaaaaaaaaaaaaaaaaaaaaaaaaaaaaaaaaaaaaaaaaaaaaaaaaaaaaaaaaaaaaaaaaaaaaaaaaaaaaaaaaaaaaaaaaaaaaaaaaaaaaaaaaaaaaaaaaaaaaaaaaaaaaaaaaaaaaaaaaaaaaaaaaaaaaaaaaaaaaaaaaaaaaaaaaaaaaaaaaaaaaaaaaaaaaaaaaaaaaaaaaaaaaaaaaaaaaaaaaaaaaaaaaaaaaaaaaaaaaaaaaaaaaaaaaaaaaaaaaaaaaaaaaaaaaaaaaaaaaaaaaaaaaaaaaaaaaaaaaaaaaaaaaaaaaaaaaaaaaaaaaaaaaaaaaaaaaaaaaaaaaaaaaaaaaaaaaaaaaaaaaaaaaaaaaaaaaaaaaaaaaaaaaaaaaaaaaaaaaaaaaaaaaaaaaaaaaaaaaaaaaaaaaaaaaaaaaaaaaaaaaaaaaaaaaaaaaaaaaaaaaaaaaaaaaaaaaaaaaaaaaaaaaaaaaaaaaaaaaaaaaaaaaaaaaaaaaaaaaaaaaaaaaaaaaaaaaaaaaaaaaaaaaaaaaaaaaaaaaaaaaaaaaaaaaaaaaaaaaaaaaaaaaaaaaaaaaaaaaaaaaaaaaaaaaaaaaaaaaaaaaaaaaaaaaaaaaaaaaaaaaaaaaaaaaaaaaaaaaaaaaaaaaaaaaaaaaaaaaaaaaaaaaaaaaaaaaaaaaaaaaaaaaaaaaaaaaaaaaaaaaaaaaaaaaaaaaaaaaaaaaaaaaaaaaaaaaaaaaaaaaaaaaaaaaaaaaaaaaa), failed: Operation not permitted
*** Check failed: /tmp/bracket/build/2012.06.14.20.18.16-sparc/src/tests/modules/t_modctl.c:303: load(NULL, false, "%s", longname) == ENAMETOOLONG not met
modctl(MODCTL_LOAD, /usr/tests/modules/k_helper/k_helper.kmod), failed: Operation not permitted

Test case: modules/t_modctl/cmd_load_props

Duration: 0.138118 seconds

Termination reason

FAILED: Module load failed

Standard output stream

Loading module without properties
Loading module /usr/tests/modules/k_helper/k_helper.kmod

Standard error stream

modctl(MODCTL_LOAD, /usr/tests/modules/k_helper/k_helper.kmod), failed: Operation not permitted

Test case: modules/t_modctl/cmd_load_recurse

Duration: 0.130000 seconds

Termination reason

FAILED: Module load failed

Standard output stream

Loading module with request to load another module
Loading module /usr/tests/modules/k_helper/k_helper.kmod

Standard error stream

modctl(MODCTL_LOAD, /usr/tests/modules/k_helper/k_helper.kmod), failed: Operation not permitted

Test case: modules/t_modctl/cmd_stat

Duration: 0.134414 seconds

Termination reason

FAILED: Module load failed

Standard output stream

Querying sysctl variable: vendor.k_helper.present
Loading module /usr/tests/modules/k_helper/k_helper.kmod

Standard error stream

modctl(MODCTL_LOAD, /usr/tests/modules/k_helper/k_helper.kmod), failed: Operation not permitted

Test case: modules/t_modctl/cmd_unload

Duration: 0.130000 seconds

Termination reason

FAILED: Module load failed

Standard output stream

Loading module /usr/tests/modules/k_helper/k_helper.kmod

Standard error stream

modctl(MODCTL_LOAD, /usr/tests/modules/k_helper/k_helper.kmod), failed: Operation not permitted

Test case: modules/t_abi_uvm/PAGE_SIZE

Duration: 0.870000 seconds

Termination reason

SKIPPED: host does not support modules

Standard output stream

Loading module /usr/tests/modules/k_helper/k_helper.kmod

Test case: modules/t_modload/iflag

Duration: 0.878752 seconds

Termination reason

SKIPPED: host does not support modules

Standard output stream

Loading module /usr/tests/modules/k_helper/k_helper.kmod

Standard error stream

t_modload: ERROR: The test case cleanup returned a non-ok exit code, but this is not allowed

Test case: modules/t_modload/plain

Duration: 0.810000 seconds

Termination reason

SKIPPED: host does not support modules

Standard output stream

Loading module /usr/tests/modules/k_helper/k_helper.kmod

Standard error stream

t_modload: ERROR: The test case cleanup returned a non-ok exit code, but this is not allowed

Test case: modules/t_modload/sflag

Duration: 0.810000 seconds

Termination reason

SKIPPED: host does not support modules

Standard output stream

Loading module /usr/tests/modules/k_helper/k_helper.kmod

Standard error stream

t_modload: ERROR: The test case cleanup returned a non-ok exit code, but this is not allowed

Test case: rump/rumpkern/t_kern/lockme_DOUBLEINIT

Duration: 0.050000 seconds

Termination reason

SKIPPED: test requires LOCKDEBUG kernel

Test case: rump/rumpkern/t_kern/lockme_MEMFREE

Duration: 0.050000 seconds

Termination reason

SKIPPED: test requires LOCKDEBUG kernel

Test case: rump/rumpkern/t_kern/lockme_RWRX

Duration: 0.056967 seconds

Termination reason

SKIPPED: test requires LOCKDEBUG kernel

Test case: rump/modautoload/t_modautoload/modautoload

Duration: 0.040000 seconds

Termination reason

SKIPPED: host kernel modules not supported on this architecture

Test case: sbin/resize_ffs/t_shrink/shrink_24M_16M_v2_4096

Duration: 67.780000 seconds

Termination reason

XFAIL: PR bin/44205: atf-check failed; see the output of the test for details

Standard output stream

in resize_ffs: 4096 512 49152 32768 2 41
bs is 4096 numdata is 41
****resizing fs with blocksize 4096
fsimage: 24.0MB (49152 sectors) block size 4096, fragment size 512
	using 4 cylinder groups of 6.00MB, 1536 blks, 2720 inodes.
super-block backups (for fsck_ffs -b #) at:
144, 12432, 24720, 37008,
Executing command [ rump_ffs fsimage mnt ]
remove is 14 dataleft is 27
Executing command [ resize_ffs -y -s 32768 fsimage ]

Standard error stream

tar: Failed write to file TD41/131073 (Input/output error)
tar: Failed write to file TD41/65536 (Input/output error)
tar: Failed write to file TD41/65537 (Input/output error)
Fail: incorrect exit status: 1, expected: 0
stdout:

stderr:
resize_ffs: shrinking not supported for ufs2

umount: /tmp/atf-run.00362v/mnt: not currently mounted

Test case: sbin/resize_ffs/t_shrink_swapped/shrink_24M_16M_v2_16384

Duration: 69.900370 seconds

Termination reason

XFAIL: PR bin/44205: atf-check failed; see the output of the test for details

Standard output stream

in resize_ffs: 16384 2048 49152 32768 2 43 swap
bs is 16384 numdata is 43
****resizing fs with blocksize 16384
fsimage: 24.0MB (49152 sectors) block size 16384, fragment size 2048
	using 4 cylinder groups of 6.00MB, 384 blks, 768 inodes.
super-block backups (for fsck_ffs -b #) at:
160, 12448, 24736, 37024,
Executing command [ rump_ffs fsimage mnt ]
remove is 15 dataleft is 28
Executing command [ resize_ffs -y -s 32768 fsimage ]

Standard error stream

Fail: incorrect exit status: 1, expected: 0
stdout:

stderr:
resize_ffs: shrinking not supported for ufs2

umount: /tmp/atf-run.00362f/mnt: not currently mounted

Test case: usr.bin/cc/t_hello/hello32

Duration: 0.716098 seconds

Termination reason

SKIPPED: this is not a 64 bit architecture

Test case: usr.bin/sed/t_sed/emptybackref

Duration: 0.810382 seconds

Termination reason

XFAIL: PR bin/28126: atf-check failed; see the output of the test for details

Standard output stream

Executing command [ /bin/sh -c echo foo1bar1 | sed -ne '/foo\(.*\)bar\1/p' ]
Executing command [ /bin/sh -c echo foobar | sed -ne '/foo\(.*\)bar\1/p' ]

Standard error stream

Fail: stdout does not match expected value
--- /tmp/inline.18917b	2012-06-21 00:46:07.000000000 +0000
+++ /tmp/check.18917a/stdout	2012-06-21 00:46:07.000000000 +0000
@@ -1 +0,0 @@
-foobar

Test case: usr.sbin/useradd/t_useradd/longname

Duration: 1.319645 seconds

Termination reason

XFAIL: PR bin/39546: atf-check failed; see the output of the test for details

Standard output stream

Executing command [ /bin/sh -c useradd test5678901234567 ]
Executing command [ /bin/sh -c userdel test5678901234567 ]

Standard error stream

Fail: incorrect exit status: 1, expected: 0
stdout:

stderr:
useradd: Can't add user `test5678901234567': invalid login name